{"text_format":"1","workbook":"xlsx","n_sheets":5,"sheets":["Einstellungen","Runden","Rang","Punkte","Ergebnis Lauf"],"not_rendered":{"charts":0,"images":0,"macros":1,"external_links":0,"defined_names":15,"comments":1,"pivot_tables":0},"unopened":[],"bounds":{"document_bytes":16777216,"sheet_cells":100000,"rows_first":2000,"rows_last":500,"rows_between":2000,"halvings":0,"cell_chars":16384,"cell_head_chars":4096},"cells_cut":0,"cells_raw":0,"read":"whole","date_system":"1900"}

{"sheet":"Einstellungen","index":0,"n_rows":81,"n_cols":6,"rows_kept":81,"cut":false,"hidden":false,"merged":[[80,3,80,5],[81,3,81,5],[82,3,82,5],[83,3,83,5],[84,3,84,5],[77,3,77,5],[78,3,78,5],[79,3,79,5],[19,3,19,5],[72,3,72,5],[73,3,73,5],[74,3,74,5],[75,3,75,5],[76,3,76,5],[61,3,61,5],[59,3,59,5],[45,3,45,5],[55,3,55,5],[57,3,57,5],[56,3,56,5],[44,3,44,5],[60,3,60,5],[33,3,33,5],[36,3,36,5],[37,3,37,5],[38,3,38,5],[34,3,34,5],[41,3,41,5],[42,3,42,5],[48,3,48,5],[51,3,51,5],[52,3,52,5],[54,3,54,5],[47,3,47,5],[43,3,43,5],[35,3,35,5],[64,3,64,5],[62,3,62,5],[63,3,63,5],[65,3,65,5],[66,3,66,5],[71,3,71,5],[67,3,67,5],[69,3,69,5],[70,3,70,5],[68,3,68,5],[0,0,0,1],[1,3,1,4],[7,3,7,4],[8,3,8,4],[21,3,21,5],[14,3,14,5],[13,3,13,5],[12,3,12,5],[20,3,20,5],[16,3,16,5],[17,3,17,5],[18,3,18,5],[15,3,15,5],[26,3,26,5],[27,3,27,5],[29,3,29,5],[40,3,40,5],[22,3,22,5],[31,3,31,5],[28,3,28,5],[25,3,25,5],[30,3,30,5],[39,3,39,5]]}
["Punktevergabe",null,null,null,null,"      Bezeichnung: Rennserienvorlage 50TNx20L-EL      Stand: 01.12.2015"]
["Rang","Punkte",null,"Anzahl der",null,"     Funktionsumfang:"]
[1,20,null,"Läufe insgesamt:",10,"     Die Vorlage kann verwendet werden für:"]
[2,18,null,"erforderl. Wertungsläufe:",1,"     - max. 50 Teilnehmer"]
[3,16,null,"Steichergebnisse:",3,"     - max. 20 Läufe"]
[4,15,null,"Rang bei Punktegleichstand:","unverändert","     Die Vergabe von Zusatzpunkten ist nicht möglich."]
{"$rows_left_out":76}
{"sheet":"Runden","index":1,"n_rows":54,"n_cols":25,"rows_kept":54,"cut":false,"hidden":false,"merged":[]}
[{"$f":"Einstellungen!D9&\" (gefahrene Runden)\"","v":"DTM2019 (gefahrene Runden)"}]
[null,"1. Lauf","2. Lauf","3. Lauf","4. Lauf","5. Lauf","6. Lauf","7. Lauf","8. Lauf","9. Lauf","10. Lauf","11. Lauf","12. Lauf","13. Lauf","14. Lauf","15. Lauf","16. Lauf","17. Lauf","18. Lauf","19. Lauf","20. Lauf","Gesamt-","Platz aus"]
["Teilnehmer  /   Datum",{"$f":"Startdatum","v":"2018-12-04"},{"$f":"B3+IF(B3>0,Wiederholung,)","v":"2019-01-01"},"2019-01-29","2019-02-26","2019-03-26","2019-04-23","2019-05-21","2019-06-18","2019-07-16","2019-08-13","2019-09-10","2019-10-08","2019-11-05","2019-12-03","2019-12-31","2020-01-28","2020-02-25","2020-03-24","2020-04-21","2020-05-19","Runden","Runden"]
["Ronald",134.65,null,null,null,null,null,null,null,null,null,null,null,null,null,null,null,null,null,null,null,{"$f":"SUM(B4:U4)","v":134.65},{"$f":"IF(V4>0,RANK(V4,$V$4:$V$53,0),0)","v":7}]
["Günter",136.03,null,null,null,null,null,null,null,null,null,null,null,null,null,null,null,null,null,null,null,136.03,5]
["Marcus",135.38999999999999,null,null,null,null,null,null,null,null,null,null,null,null,null,null,null,null,null,null,null,135.38999999999999,6]
{"$rows_left_out":49}
{"sheet":"Rang","index":2,"n_rows":53,"n_cols":82,"rows_kept":53,"cut":false,"hidden":true,"merged":[]}
[{"$f":"Einstellungen!D9&\" (Rang)\"","v":"DTM2019 (Rang)"},null,null,null,null,null,null,null,null,null,null,null,null,null,null,null,null,null,null,null,null,null,null,null,null,null,null,null,null,null,null,null,null,null,null,null,null,null,null,null,null,null,null,null,null,null,"Wiederholung: Rang",null,null,null,null,null,null,null,null,null,"aufsteigender",null,null,null,null,null,null,null,null,null,null,"aufsteigender",null,null,null,null,null,null,null,null,null,null,"aufsteigender",null,"Platzierungs-","absteigender Rang"]
["Anzahl Teilnehmer:",{"$f":"50-COUNTIF(B4:B53,0)","v":10},{"$f":"50-COUNTIF(C4:C53,0)","v":0},0,0,0,0,0,0,0,0,0,0,0,0,0,0,0,0,0,0,null,"Anzahl Platzierung",null,null,null,null,null,null,null,null,null,null,null,null,null,null,null,null,null,null,null,null,null,null,null,"aus Platzierungswerten","Wert der ersten 8 Platzierungen",null,null,null,null,null,null,null,null,"Rang aus",null,"Wert der Platzierungen 9-16",null,null,null,null,null,null,null,null,"Rang aus",null,"Wert der Platzierungen 17-24",null,null,null,null,null,null,null,null,"Rang aus",null,"wert aus den","aus Platzierungs-"]
["Namen","1. Lauf","2. Lauf","3. Lauf","4. Lauf","5. Lauf","6. Lauf","7. Lauf","8. Lauf","9. Lauf","10. Lauf","11. Lauf","12. Lauf","13. Lauf","14. Lauf","15. Lauf","16. Lauf","17. Lauf","18. Lauf","19. Lauf","20. Lauf",null,1,2,3,4,5,6,7,8,9,10,11,12,13,14,15,16,17,18,19,20,21,22,23,24,"(aus Spalte \"CD\")",1,2,3,4,5,6,7,8,"Summe","Summe",null,9,10,11,12,13,14,15,16,"Summe","Summe",null,17,18,19,20,21,22,23,24,"Summe","Summe",null,"Plätzen 1-24","werten"]
[{"$f":"IF(Runden!A4=\"\",\"\",Runden!A4)","v":"Ronald"},{"$f":"IF(Runden!B4>0,RANK(Runden!B4,Runden!B$4:B$53,0),0)","v":7},{"$f":"IF(Runden!C4>0,RANK(Runden!C4,Runden!C$4:C$53,0),0)","v":0},{"$f":"IF(Runden!D4>0,RANK(Runden!D4,Runden!D$4:D$53,0),0)","v":0},{"$f":"IF(Runden!E4>0,RANK(Runden!E4,Runden!E$4:E$53,0),0)","v":0},{"$f":"IF(Runden!F4>0,RANK(Runden!F4,Runden!F$4:F$53,0),0)","v":0},{"$f":"IF(Runden!G4>0,RANK(Runden!G4,Runden!G$4:G$53,0),0)","v":0},{"$f":"IF(Runden!H4>0,RANK(Runden!H4,Runden!H$4:H$53,0),0)","v":0},{"$f":"IF(Runden!I4>0,RANK(Runden!I4,Runden!I$4:I$53,0),0)","v":0},{"$f":"IF(Runden!J4>0,RANK(Runden!J4,Runden!J$4:J$53,0),0)","v":0},{"$f":"IF(Runden!K4>0,RANK(Runden!K4,Runden!K$4:K$53,0),0)","v":0},{"$f":"IF(Runden!L4>0,RANK(Runden!L4,Runden!L$4:L$53,0),0)","v":0},{"$f":"IF(Runden!M4>0,RANK(Runden!M4,Runden!M$4:M$53,0),0)","v":0},{"$f":"IF(Runden!N4>0,RANK(Runden!N4,Runden!N$4:N$53,0),0)","v":0},{"$f":"IF(Runden!O4>0,RANK(Runden!O4,Runden!O$4:O$53,0),0)","v":0},{"$f":"IF(Runden!P4>0,RANK(Runden!P4,Runden!P$4:P$53,0),0)","v":0},{"$f":"IF(Runden!Q4>0,RANK(Runden!Q4,Runden!Q$4:Q$53,0),0)","v":0},{"$f":"IF(Runden!R4>0,RANK(Runden!R4,Runden!R$4:R$53,0),0)","v":0},{"$f":"IF(Runden!S4>0,RANK(Runden!S4,Runden!S$4:S$53,0),0)","v":0},{"$f":"IF(Runden!T4>0,RANK(Runden!T4,Runden!T$4:T$53,0),0)","v":0},{"$f":"IF(Runden!U4>0,RANK(Runden!U4,Runden!U$4:U$53,0),0)","v":0},null,{"$f":"COUNTIF($B4:$U4,W$3)","v":0},{"$f":"COUNTIF($B4:$U4,X$3)","v":0},0,0,0,0,1,0,0,0,0,0,0,0,0,0,0,0,0,{"$f":"COUNTIF($B4:$U4,AP$3)","v":0},0,0,0,0,{"$f":"CD4","v":44},{"$f":"W4%","v":0},{"$f":"X4%%","v":0},{"$f":"Y4%%%","v":0},{"$f":"Z4%%%%","v":0},{"$f":"AA4%%%%%","v":0},{"$f":"AB4%%%%%%","v":0},{"$f":"AC4%%%%%%%","v":1E-14},{"$f":"AD4%%%%%%%%","v":0},{"$f":"SUM(AV4:BC4)","v":1E-14},{"$f":"IF(BD4=0,0,RANK(BD4,$BD$4:$BD$53,1))","v":44},{"$f":"BE4/1000","v":4.3999999999999997E-2},{"$f":"AE4%","v":0},{"$f":"AF4%%","v":0},{"$f":"AG4%%%","v":0},{"$f":"AH4%%%%","v":0},{"$f":"AI4%%%%%","v":0},{"$f":"AJ4%%%%%%","v":0},{"$f":"AK4%%%%%%%","v":0},{"$f":"AL4%%%%%%%%","v":0},{"$f":"SUM(BG4:BN4)","v":0},{"$f":"IF(BO4=0,0,RANK(BO4,$BO$4:$BO$53,1))","v":0},{"$f":"BP4/100000","v":0},{"$f":"AM4%","v":0},{"$f":"AN4%%","v":0},{"$f":"AO4%%%","v":0},{"$f":"AP4%%%%","v":0},{"$f":"AQ4%%%%%","v":0},{"$f":"AR4%%%%%%","v":0},{"$f":"AS4%%%%%%%","v":0},{"$f":"AT4%%%%%%%%","v":0},{"$f":"SUM(BR4:BY4)","v":0},{"$f":"IF(BZ4=0,0,RANK(BZ4,$BZ$4:$BZ$53,1))","v":0},{"$f":"CA4/10000000","v":0},{"$f":"BF4+BQ4+CB4","v":4.3999999999999997E-2},{"$f":"RANK(CC4,$CC$4:$CC$53,1)","v":44}]
[{"$f":"IF(Runden!A5=\"\",\"\",Runden!A5)","v":"Günter"},{"$f":"IF(Runden!B5>0,RANK(Runden!B5,Runden!B$4:B$53,0),0)","v":5},{"$f":"IF(Runden!C5>0,RANK(Runden!C5,Runden!C$4:C$53,0),0)","v":0},{"$f":"IF(Runden!D5>0,RANK(Runden!D5,Runden!D$4:D$53,0),0)","v":0},{"$f":"IF(Runden!E5>0,RANK(Runden!E5,Runden!E$4:E$53,0),0)","v":0},{"$f":"IF(Runden!F5>0,RANK(Runden!F5,Runden!F$4:F$53,0),0)","v":0},{"$f":"IF(Runden!G5>0,RANK(Runden!G5,Runden!G$4:G$53,0),0)","v":0},{"$f":"IF(Runden!H5>0,RANK(Runden!H5,Runden!H$4:H$53,0),0)","v":0},{"$f":"IF(Runden!I5>0,RANK(Runden!I5,Runden!I$4:I$53,0),0)","v":0},{"$f":"IF(Runden!J5>0,RANK(Runden!J5,Runden!J$4:J$53,0),0)","v":0},{"$f":"IF(Runden!K5>0,RANK(Runden!K5,Runden!K$4:K$53,0),0)","v":0},{"$f":"IF(Runden!L5>0,RANK(Runden!L5,Runden!L$4:L$53,0),0)","v":0},{"$f":"IF(Runden!M5>0,RANK(Runden!M5,Runden!M$4:M$53,0),0)","v":0},{"$f":"IF(Runden!N5>0,RANK(Runden!N5,Runden!N$4:N$53,0),0)","v":0},{"$f":"IF(Runden!O5>0,RANK(Runden!O5,Runden!O$4:O$53,0),0)","v":0},{"$f":"IF(Runden!P5>0,RANK(Runden!P5,Runden!P$4:P$53,0),0)","v":0},{"$f":"IF(Runden!Q5>0,RANK(Runden!Q5,Runden!Q$4:Q$53,0),0)","v":0},{"$f":"IF(Runden!R5>0,RANK(Runden!R5,Runden!R$4:R$53,0),0)","v":0},{"$f":"IF(Runden!S5>0,RANK(Runden!S5,Runden!S$4:S$53,0),0)","v":0},{"$f":"IF(Runden!T5>0,RANK(Runden!T5,Runden!T$4:T$53,0),0)","v":0},{"$f":"IF(Runden!U5>0,RANK(Runden!U5,Runden!U$4:U$53,0),0)","v":0},null,{"$f":"COUNTIF($B5:$U5,W$3)","v":0},0,0,0,1,0,0,0,0,0,0,0,0,0,0,0,0,0,0,0,0,0,0,0,{"$f":"CD5","v":46},{"$f":"W5%","v":0},{"$f":"X5%%","v":0},{"$f":"Y5%%%","v":0},{"$f":"Z5%%%%","v":0},{"$f":"AA5%%%%%","v":1E-10},{"$f":"AB5%%%%%%","v":0},{"$f":"AC5%%%%%%%","v":0},{"$f":"AD5%%%%%%%%","v":0},1E-10,{"$f":"IF(BD5=0,0,RANK(BD5,$BD$4:$BD$53,1))","v":46},{"$f":"BE5/1000","v":4.5999999999999999E-2},{"$f":"AE5%","v":0},{"$f":"AF5%%","v":0},{"$f":"AG5%%%","v":0},{"$f":"AH5%%%%","v":0},{"$f":"AI5%%%%%","v":0},{"$f":"AJ5%%%%%%","v":0},{"$f":"AK5%%%%%%%","v":0},{"$f":"AL5%%%%%%%%","v":0},0,{"$f":"IF(BO5=0,0,RANK(BO5,$BO$4:$BO$53,1))","v":0},{"$f":"BP5/100000","v":0},{"$f":"AM5%","v":0},{"$f":"AN5%%","v":0},{"$f":"AO5%%%","v":0},{"$f":"AP5%%%%","v":0},{"$f":"AQ5%%%%%","v":0},{"$f":"AR5%%%%%%","v":0},{"$f":"AS5%%%%%%%","v":0},{"$f":"AT5%%%%%%%%","v":0},0,{"$f":"IF(BZ5=0,0,RANK(BZ5,$BZ$4:$BZ$53,1))","v":0},{"$f":"CA5/10000000","v":0},{"$f":"BF5+BQ5+CB5","v":4.5999999999999999E-2},{"$f":"RANK(CC5,$CC$4:$CC$53,1)","v":46}]
[{"$f":"IF(Runden!A6=\"\",\"\",Runden!A6)","v":"Marcus"},{"$f":"IF(Runden!B6>0,RANK(Runden!B6,Runden!B$4:B$53,0),0)","v":6},{"$f":"IF(Runden!C6>0,RANK(Runden!C6,Runden!C$4:C$53,0),0)","v":0},{"$f":"IF(Runden!D6>0,RANK(Runden!D6,Runden!D$4:D$53,0),0)","v":0},{"$f":"IF(Runden!E6>0,RANK(Runden!E6,Runden!E$4:E$53,0),0)","v":0},{"$f":"IF(Runden!F6>0,RANK(Runden!F6,Runden!F$4:F$53,0),0)","v":0},{"$f":"IF(Runden!G6>0,RANK(Runden!G6,Runden!G$4:G$53,0),0)","v":0},{"$f":"IF(Runden!H6>0,RANK(Runden!H6,Runden!H$4:H$53,0),0)","v":0},{"$f":"IF(Runden!I6>0,RANK(Runden!I6,Runden!I$4:I$53,0),0)","v":0},{"$f":"IF(Runden!J6>0,RANK(Runden!J6,Runden!J$4:J$53,0),0)","v":0},{"$f":"IF(Runden!K6>0,RANK(Runden!K6,Runden!K$4:K$53,0),0)","v":0},{"$f":"IF(Runden!L6>0,RANK(Runden!L6,Runden!L$4:L$53,0),0)","v":0},{"$f":"IF(Runden!M6>0,RANK(Runden!M6,Runden!M$4:M$53,0),0)","v":0},{"$f":"IF(Runden!N6>0,RANK(Runden!N6,Runden!N$4:N$53,0),0)","v":0},{"$f":"IF(Runden!O6>0,RANK(Runden!O6,Runden!O$4:O$53,0),0)","v":0},{"$f":"IF(Runden!P6>0,RANK(Runden!P6,Runden!P$4:P$53,0),0)","v":0},{"$f":"IF(Runden!Q6>0,RANK(Runden!Q6,Runden!Q$4:Q$53,0),0)","v":0},{"$f":"IF(Runden!R6>0,RANK(Runden!R6,Runden!R$4:R$53,0),0)","v":0},{"$f":"IF(Runden!S6>0,RANK(Runden!S6,Runden!S$4:S$53,0),0)","v":0},{"$f":"IF(Runden!T6>0,RANK(Runden!T6,Runden!T$4:T$53,0),0)","v":0},{"$f":"IF(Runden!U6>0,RANK(Runden!U6,Runden!U$4:U$53,0),0)","v":0},null,0,0,0,0,0,1,0,0,0,0,0,0,0,0,0,0,0,0,0,0,0,0,0,0,{"$f":"CD6","v":45},0,0,0,0,0,9.9999999999999998E-13,0,0,9.9999999999999998E-13,45,4.4999999999999998E-2,0,0,0,0,0,0,0,0,0,0,0,0,0,0,0,0,0,0,0,0,0,0,4.4999999999999998E-2,45]
{"$rows_left_out":48}
{"sheet":"Punkte","index":3,"n_rows":54,"n_cols":55,"rows_kept":54,"cut":false,"hidden":false,"merged":[[1,39,1,44],[1,30,1,36],[1,25,1,26],[1,21,1,23]]}
[{"$f":"Einstellungen!D9&\" (Punkte)\"","v":"DTM2019 (Punkte)"},null,null,null,null,null,null,null,null,null,null,null,null,null,null,null,null,null,null,null,null,null,"Ergebnis",null,"Gewertete",{"$f":"IF(AnzahlLäufeGefahren<LäufeInsgesamt,\"vorläufiger Endstand\", \"Endstand\")","v":"vorläufiger Endstand"},null,null,null,null,null,null,null,null,null,null,null,null,null,null,null,null,null,null,null,null,null,null,null,null,"Rang aus","1/1000sel aus","Wert aus","Rang aus","1/1000stel aus"]
[null,"1. Lauf","2. Lauf","3. Lauf","4. Lauf","5. Lauf","6. Lauf","7. Lauf","8. Lauf","9. Lauf","10. Lauf","11. Lauf","12. Lauf","13. Lauf","14. Lauf","15. Lauf","16. Lauf","17. Lauf","18. Lauf","19. Lauf","20. Lauf","(aus allen Läufen)",null,null,"Läufe\n",{"$f":"\"(mind. \"&Einstellungen!E4& IF(Einstellungen!E4=1,\" Lauf \",\" Läufe \")&\"\n\"&\"bei \"&Einstellungen!E5&IF(Einstellungen!E5=1,\" Streicher)\",\" Streichern)\")","v":"(mind. 1 Lauf \nbei 3 Streichern)"},null,null,null,"Anzahl","max. Anzahl der Wertungsläufe:",null,null,null,null,null,null,{"$f":"Einstellungen!E3-Einstellungen!E5","v":7},null,"erforderliche Wertungsläufe:",null,null,null,null,null,{"$f":"Einstellungen!E4","v":1},null,null,null,null,{"$f":"Einstellungen!E6","v":"unverändert"},"absteigendem\nRang aus","Punkte+","Punkten+","absteigendem\nRang aus"]
["Teilnehmer",{"$f":"Runden!B3","v":"2018-12-04"},{"$f":"Runden!C3","v":"2019-01-01"},{"$f":"Runden!D3","v":"2019-01-29"},{"$f":"Runden!E3","v":"2019-02-26"},{"$f":"Runden!F3","v":"2019-03-26"},{"$f":"Runden!G3","v":"2019-04-23"},{"$f":"Runden!H3","v":"2019-05-21"},{"$f":"Runden!I3","v":"2019-06-18"},{"$f":"Runden!J3","v":"2019-07-16"},{"$f":"Runden!K3","v":"2019-08-13"},{"$f":"Runden!L3","v":"2019-09-10"},{"$f":"Runden!M3","v":"2019-10-08"},{"$f":"Runden!N3","v":"2019-11-05"},{"$f":"Runden!O3","v":"2019-12-03"},{"$f":"Runden!P3","v":"2019-12-31"},{"$f":"Runden!Q3","v":"2020-01-28"},{"$f":"Runden!R3","v":"2020-02-25"},{"$f":"Runden!S3","v":"2020-03-24"},{"$f":"Runden!T3","v":"2020-04-21"},{"$f":"Runden!U3","v":"2020-05-19"},"Punkte","Platz","Runden","Anzahl","Punkte","Platz",null,null,"Wertungen",1,2,3,4,5,6,7,8,9,10,11,12,13,14,15,16,17,18,19,20,null,"G-Runden","Runden","Runden","\"bester Platz\""]
[{"$f":"IF(Runden!A10=\"\",\"\",Runden!A10)","v":"Ewald"},{"$f":"IF(Rang!B10>0,VLOOKUP(Rang!B10,Einstellungen!$A$3:$B$52,2,FALSE),0)","v":20},{"$f":"IF(Rang!C10>0,VLOOKUP(Rang!C10,Einstellungen!$A$3:$B$52,2,FALSE),0)","v":0},{"$f":"IF(Rang!D10>0,VLOOKUP(Rang!D10,Einstellungen!$A$3:$B$52,2,FALSE),0)","v":0},{"$f":"IF(Rang!E10>0,VLOOKUP(Rang!E10,Einstellungen!$A$3:$B$52,2,FALSE),0)","v":0},{"$f":"IF(Rang!F10>0,VLOOKUP(Rang!F10,Einstellungen!$A$3:$B$52,2,FALSE),0)","v":0},{"$f":"IF(Rang!G10>0,VLOOKUP(Rang!G10,Einstellungen!$A$3:$B$52,2,FALSE),0)","v":0},{"$f":"IF(Rang!H10>0,VLOOKUP(Rang!H10,Einstellungen!$A$3:$B$52,2,FALSE),0)","v":0},{"$f":"IF(Rang!I10>0,VLOOKUP(Rang!I10,Einstellungen!$A$3:$B$52,2,FALSE),0)","v":0},{"$f":"IF(Rang!J10>0,VLOOKUP(Rang!J10,Einstellungen!$A$3:$B$52,2,FALSE),0)","v":0},{"$f":"IF(Rang!K10>0,VLOOKUP(Rang!K10,Einstellungen!$A$3:$B$52,2,FALSE),0)","v":0},{"$f":"IF(Rang!L10>0,VLOOKUP(Rang!L10,Einstellungen!$A$3:$B$52,2,FALSE),0)","v":0},{"$f":"IF(Rang!M10>0,VLOOKUP(Rang!M10,Einstellungen!$A$3:$B$52,2,FALSE),0)","v":0},{"$f":"IF(Rang!N10>0,VLOOKUP(Rang!N10,Einstellungen!$A$3:$B$52,2,FALSE),0)","v":0},{"$f":"IF(Rang!O10>0,VLOOKUP(Rang!O10,Einstellungen!$A$3:$B$52,2,FALSE),0)","v":0},{"$f":"IF(Rang!P10>0,VLOOKUP(Rang!P10,Einstellungen!$A$3:$B$52,2,FALSE),0)","v":0},{"$f":"IF(Rang!Q10>0,VLOOKUP(Rang!Q10,Einstellungen!$A$3:$B$52,2,FALSE),0)","v":0},{"$f":"IF(Rang!R10>0,VLOOKUP(Rang!R10,Einstellungen!$A$3:$B$52,2,FALSE),0)","v":0},{"$f":"IF(Rang!S10>0,VLOOKUP(Rang!S10,Einstellungen!$A$3:$B$52,2,FALSE),0)","v":0},{"$f":"IF(Rang!T10>0,VLOOKUP(Rang!T10,Einstellungen!$A$3:$B$52,2,FALSE),0)","v":0},{"$f":"IF(Rang!U10>0,VLOOKUP(Rang!U10,Einstellungen!$A$3:$B$52,2,FALSE),0)","v":0},{"$f":"SUM(B4:U4)+IF($AY$4=2,AZ4,0)+IF($AY$4=3,BC4,0)","v":20},{"$f":"IF(SUM(B4:U4)>0,RANK(V4,$V$4:$V$53,0),0)","v":1},{"$f":"IF(SUM(B4:U4)>0,VLOOKUP(A4,TabRunden,22,FALSE),0)","v":143.05000000000001},{"$f":"AD4","v":1},{"$f":"IF(AD4>=$AT$2,LOOKUP($AL$2,$AE$3:$AX$3,AE4:AX4),0)+IF($AY$4=2,AZ4,0)+IF($AY$4=3,BC4,0)","v":20},{"$f":"IF(Z4>0,RANK(Z4,$Z$4:$Z$53,0),0)","v":1},{"$f":"IF(W4=0,51,W4)+IF(A4=\"\",50,0)","v":1},{"$f":"IF(AA4=0,51,AA4)+IF(A4=\"\",50,0)","v":1},{"$f":"20-COUNTIF(B4:U4,0)","v":1},{"$f":"LARGE($B4:$U4,AE$3)","v":20},{"$f":"LARGE($B4:$U4,AF$3)+AE4","v":20},20,20,20,20,20,20,20,20,20,20,20,20,20,20,20,20,20,20,{"$f":"IF(AY2=\"unverändert\",1,IF(AY2=\"Gesamtrunden\",2,IF(AY2= \"bester Platz\",3,0)))","v":1},{"$f":"IF(X4>0,RANK(X4,$X$4:$X$53,1),0)/1000","v":0.05},{"$f":"AX4+AZ4","v":20.05},{"$f":"IF(BA4>0,RANK(BA4,$BA$4:$BA$53,0),0)","v":1},{"$f":"IF(X4>0,VLOOKUP(A4,Rang!$A$4:$AU$53,47,FALSE))/1000","v":0.05}]
[{"$f":"IF(Runden!A9=\"\",\"\",Runden!A9)","v":"Chris"},{"$f":"IF(Rang!B9>0,VLOOKUP(Rang!B9,Einstellungen!$A$3:$B$52,2,FALSE),0)","v":18},{"$f":"IF(Rang!C9>0,VLOOKUP(Rang!C9,Einstellungen!$A$3:$B$52,2,FALSE),0)","v":0},{"$f":"IF(Rang!D9>0,VLOOKUP(Rang!D9,Einstellungen!$A$3:$B$52,2,FALSE),0)","v":0},{"$f":"IF(Rang!E9>0,VLOOKUP(Rang!E9,Einstellungen!$A$3:$B$52,2,FALSE),0)","v":0},{"$f":"IF(Rang!F9>0,VLOOKUP(Rang!F9,Einstellungen!$A$3:$B$52,2,FALSE),0)","v":0},{"$f":"IF(Rang!G9>0,VLOOKUP(Rang!G9,Einstellungen!$A$3:$B$52,2,FALSE),0)","v":0},{"$f":"IF(Rang!H9>0,VLOOKUP(Rang!H9,Einstellungen!$A$3:$B$52,2,FALSE),0)","v":0},{"$f":"IF(Rang!I9>0,VLOOKUP(Rang!I9,Einstellungen!$A$3:$B$52,2,FALSE),0)","v":0},{"$f":"IF(Rang!J9>0,VLOOKUP(Rang!J9,Einstellungen!$A$3:$B$52,2,FALSE),0)","v":0},{"$f":"IF(Rang!K9>0,VLOOKUP(Rang!K9,Einstellungen!$A$3:$B$52,2,FALSE),0)","v":0},{"$f":"IF(Rang!L9>0,VLOOKUP(Rang!L9,Einstellungen!$A$3:$B$52,2,FALSE),0)","v":0},{"$f":"IF(Rang!M9>0,VLOOKUP(Rang!M9,Einstellungen!$A$3:$B$52,2,FALSE),0)","v":0},{"$f":"IF(Rang!N9>0,VLOOKUP(Rang!N9,Einstellungen!$A$3:$B$52,2,FALSE),0)","v":0},{"$f":"IF(Rang!O9>0,VLOOKUP(Rang!O9,Einstellungen!$A$3:$B$52,2,FALSE),0)","v":0},{"$f":"IF(Rang!P9>0,VLOOKUP(Rang!P9,Einstellungen!$A$3:$B$52,2,FALSE),0)","v":0},{"$f":"IF(Rang!Q9>0,VLOOKUP(Rang!Q9,Einstellungen!$A$3:$B$52,2,FALSE),0)","v":0},{"$f":"IF(Rang!R9>0,VLOOKUP(Rang!R9,Einstellungen!$A$3:$B$52,2,FALSE),0)","v":0},{"$f":"IF(Rang!S9>0,VLOOKUP(Rang!S9,Einstellungen!$A$3:$B$52,2,FALSE),0)","v":0},{"$f":"IF(Rang!T9>0,VLOOKUP(Rang!T9,Einstellungen!$A$3:$B$52,2,FALSE),0)","v":0},{"$f":"IF(Rang!U9>0,VLOOKUP(Rang!U9,Einstellungen!$A$3:$B$52,2,FALSE),0)","v":0},{"$f":"SUM(B5:U5)+IF($AY$4=2,AZ5,0)+IF($AY$4=3,BC5,0)","v":18},{"$f":"IF(SUM(B5:U5)>0,RANK(V5,$V$4:$V$53,0),0)","v":2},{"$f":"IF(SUM(B5:U5)>0,VLOOKUP(A5,TabRunden,22,FALSE),0)","v":139.4},{"$f":"AD5","v":1},{"$f":"IF(AD5>=$AT$2,LOOKUP($AL$2,$AE$3:$AX$3,AE5:AX5),0)+IF($AY$4=2,AZ5,0)+IF($AY$4=3,BC5,0)","v":18},{"$f":"IF(Z5>0,RANK(Z5,$Z$4:$Z$53,0),0)","v":2},{"$f":"IF(W5=0,51,W5)+IF(A5=\"\",50,0)","v":2},{"$f":"IF(AA5=0,51,AA5)+IF(A5=\"\",50,0)","v":2},1,{"$f":"LARGE($B5:$U5,AE$3)","v":18},{"$f":"LARGE($B5:$U5,AF$3)+AE5","v":18},18,18,18,18,18,18,18,18,18,18,18,18,18,18,18,18,18,18,null,{"$f":"IF(X5>0,RANK(X5,$X$4:$X$53,1),0)/1000","v":4.9000000000000002E-2},{"$f":"AX5+AZ5","v":18.048999999999999},{"$f":"IF(BA5>0,RANK(BA5,$BA$4:$BA$53,0),0)","v":2},{"$f":"IF(X5>0,VLOOKUP(A5,Rang!$A$4:$AU$53,47,FALSE))/1000","v":4.9000000000000002E-2}]
[{"$f":"IF(Runden!A14=\"\",\"\",Runden!A14)","v":"Thomas V."},{"$f":"IF(Rang!B14>0,VLOOKUP(Rang!B14,Einstellungen!$A$3:$B$52,2,FALSE),0)","v":16},{"$f":"IF(Rang!C14>0,VLOOKUP(Rang!C14,Einstellungen!$A$3:$B$52,2,FALSE),0)","v":0},{"$f":"IF(Rang!D14>0,VLOOKUP(Rang!D14,Einstellungen!$A$3:$B$52,2,FALSE),0)","v":0},{"$f":"IF(Rang!E14>0,VLOOKUP(Rang!E14,Einstellungen!$A$3:$B$52,2,FALSE),0)","v":0},{"$f":"IF(Rang!F14>0,VLOOKUP(Rang!F14,Einstellungen!$A$3:$B$52,2,FALSE),0)","v":0},{"$f":"IF(Rang!G14>0,VLOOKUP(Rang!G14,Einstellungen!$A$3:$B$52,2,FALSE),0)","v":0},{"$f":"IF(Rang!H14>0,VLOOKUP(Rang!H14,Einstellungen!$A$3:$B$52,2,FALSE),0)","v":0},{"$f":"IF(Rang!I14>0,VLOOKUP(Rang!I14,Einstellungen!$A$3:$B$52,2,FALSE),0)","v":0},{"$f":"IF(Rang!J14>0,VLOOKUP(Rang!J14,Einstellungen!$A$3:$B$52,2,FALSE),0)","v":0},{"$f":"IF(Rang!K14>0,VLOOKUP(Rang!K14,Einstellungen!$A$3:$B$52,2,FALSE),0)","v":0},{"$f":"IF(Rang!L14>0,VLOOKUP(Rang!L14,Einstellungen!$A$3:$B$52,2,FALSE),0)","v":0},{"$f":"IF(Rang!M14>0,VLOOKUP(Rang!M14,Einstellungen!$A$3:$B$52,2,FALSE),0)","v":0},{"$f":"IF(Rang!N14>0,VLOOKUP(Rang!N14,Einstellungen!$A$3:$B$52,2,FALSE),0)","v":0},{"$f":"IF(Rang!O14>0,VLOOKUP(Rang!O14,Einstellungen!$A$3:$B$52,2,FALSE),0)","v":0},{"$f":"IF(Rang!P14>0,VLOOKUP(Rang!P14,Einstellungen!$A$3:$B$52,2,FALSE),0)","v":0},{"$f":"IF(Rang!Q14>0,VLOOKUP(Rang!Q14,Einstellungen!$A$3:$B$52,2,FALSE),0)","v":0},{"$f":"IF(Rang!R14>0,VLOOKUP(Rang!R14,Einstellungen!$A$3:$B$52,2,FALSE),0)","v":0},{"$f":"IF(Rang!S14>0,VLOOKUP(Rang!S14,Einstellungen!$A$3:$B$52,2,FALSE),0)","v":0},{"$f":"IF(Rang!T14>0,VLOOKUP(Rang!T14,Einstellungen!$A$3:$B$52,2,FALSE),0)","v":0},{"$f":"IF(Rang!U14>0,VLOOKUP(Rang!U14,Einstellungen!$A$3:$B$52,2,FALSE),0)","v":0},{"$f":"SUM(B6:U6)+IF($AY$4=2,AZ6,0)+IF($AY$4=3,BC6,0)","v":16},{"$f":"IF(SUM(B6:U6)>0,RANK(V6,$V$4:$V$53,0),0)","v":3},{"$f":"IF(SUM(B6:U6)>0,VLOOKUP(A6,TabRunden,22,FALSE),0)","v":138.22},{"$f":"AD6","v":1},{"$f":"IF(AD6>=$AT$2,LOOKUP($AL$2,$AE$3:$AX$3,AE6:AX6),0)+IF($AY$4=2,AZ6,0)+IF($AY$4=3,BC6,0)","v":16},{"$f":"IF(Z6>0,RANK(Z6,$Z$4:$Z$53,0),0)","v":3},{"$f":"IF(W6=0,51,W6)+IF(A6=\"\",50,0)","v":3},{"$f":"IF(AA6=0,51,AA6)+IF(A6=\"\",50,0)","v":3},1,16,{"$f":"LARGE($B6:$U6,AF$3)+AE6","v":16},16,16,16,16,16,16,16,16,16,16,16,16,16,16,16,16,16,16,null,4.8000000000000001E-2,{"$f":"AX6+AZ6","v":16.047999999999998},3,{"$f":"IF(X6>0,VLOOKUP(A6,Rang!$A$4:$AU$53,47,FALSE))/1000","v":4.8000000000000001E-2}]
{"$rows_left_out":49}
{"sheet":"Ergebnis Lauf","index":4,"n_rows":54,"n_cols":11,"rows_kept":54,"cut":false,"hidden":false,"merged":[]}
[{"$f":"Einstellungen!D9","v":"DTM2019"},"Ergebnis Lauf:",null,{"$f":"COUNTIF(Runden!B54:U54,\">0\")","v":1},null,null,"Gewertete",null,"Stand"]
[null,null,"am",{"$f":"IF(D1=0,0,CHOOSE(D1,Runden!B3,Runden!C3,Runden!D3,Runden!E3,Runden!F3,Runden!G3,Runden!H3,Runden!I3,Runden!J3,Runden!K3,Runden!L3,Runden!M3,Runden!N3,Runden!O3,Runden!P3,Runden!Q3,Runden!R3,Runden!S3,Runden!T3,Runden!U3))","v":"2018-12-04"},null,null,"Läufe",{"$f":"\"nach dem \"&D1&\". Lauf\"","v":"nach dem 1. Lauf"}]
["Name","Runden","Rang","Punkte",null,"Name","Anzahl","Punkte","Platz","Runden"]
[{"$f":"IF(Runden!A4=\"\",\"\",Runden!A4)","v":"Ronald"},{"$f":"IF(A4=\"\",0,VLOOKUP(A4,Runden!$A$4:$U$53,IF($D$1=0,2,$D$1+1),FALSE))","v":134.65},{"$f":"IF(A4=\"\",0,VLOOKUP(A4,Rang!$A$4:$U$53,IF($D$1=0,2,$D$1+1),FALSE))","v":7},{"$f":"IF(A4=\"\",0,VLOOKUP(A4,Punkte!$A$4:$U$53,IF($D$1=0,2,$D$1+1),FALSE))","v":12},{"$f":"IF(C4=0,51,C4)+VLOOKUP(A4,Punkte!$A$4:$AC$53,27,FALSE)*0.001","v":7.0069999999999997},{"$f":"IF(Runden!A4=\"\",\"\",Runden!A4)","v":"Ronald"},{"$f":"IF(F4=\"\",0,VLOOKUP(F4,Punkte!$A$4:$AC$53,25,FALSE))","v":1},{"$f":"IF(F4=\"\",0,VLOOKUP(F4,Punkte!$A$4:$AC$53,22,FALSE))","v":12},{"$f":"IF(F4=\"\",0,VLOOKUP(F4,Punkte!$A$4:$AC$53,23,FALSE))","v":7},{"$f":"IF(F4=\"\",0,VLOOKUP(F4,Punkte!$A$4:$AC$53,24,FALSE))","v":134.65},{"$f":"IF(I4=0,51,I4)+IF(F4=\"\",50,0)","v":7}]
[{"$f":"IF(Runden!A5=\"\",\"\",Runden!A5)","v":"Günter"},{"$f":"IF(A5=\"\",0,VLOOKUP(A5,Runden!$A$4:$U$53,IF($D$1=0,2,$D$1+1),FALSE))","v":136.03},{"$f":"IF(A5=\"\",0,VLOOKUP(A5,Rang!$A$4:$U$53,IF($D$1=0,2,$D$1+1),FALSE))","v":5},{"$f":"IF(A5=\"\",0,VLOOKUP(A5,Punkte!$A$4:$U$53,IF($D$1=0,2,$D$1+1),FALSE))","v":14},{"$f":"IF(C5=0,51,C5)+VLOOKUP(A5,Punkte!$A$4:$AC$53,27,FALSE)*0.001","v":5.0049999999999999},{"$f":"IF(Runden!A5=\"\",\"\",Runden!A5)","v":"Günter"},{"$f":"IF(F5=\"\",0,VLOOKUP(F5,Punkte!$A$4:$AC$53,25,FALSE))","v":1},{"$f":"IF(F5=\"\",0,VLOOKUP(F5,Punkte!$A$4:$AC$53,22,FALSE))","v":14},{"$f":"IF(F5=\"\",0,VLOOKUP(F5,Punkte!$A$4:$AC$53,23,FALSE))","v":5},{"$f":"IF(F5=\"\",0,VLOOKUP(F5,Punkte!$A$4:$AC$53,24,FALSE))","v":136.03},5]
[{"$f":"IF(Runden!A6=\"\",\"\",Runden!A6)","v":"Marcus"},{"$f":"IF(A6=\"\",0,VLOOKUP(A6,Runden!$A$4:$U$53,IF($D$1=0,2,$D$1+1),FALSE))","v":135.38999999999999},{"$f":"IF(A6=\"\",0,VLOOKUP(A6,Rang!$A$4:$U$53,IF($D$1=0,2,$D$1+1),FALSE))","v":6},{"$f":"IF(A6=\"\",0,VLOOKUP(A6,Punkte!$A$4:$U$53,IF($D$1=0,2,$D$1+1),FALSE))","v":13},{"$f":"IF(C6=0,51,C6)+VLOOKUP(A6,Punkte!$A$4:$AC$53,27,FALSE)*0.001","v":6.0060000000000002},{"$f":"IF(Runden!A6=\"\",\"\",Runden!A6)","v":"Marcus"},{"$f":"IF(F6=\"\",0,VLOOKUP(F6,Punkte!$A$4:$AC$53,25,FALSE))","v":1},{"$f":"IF(F6=\"\",0,VLOOKUP(F6,Punkte!$A$4:$AC$53,22,FALSE))","v":13},{"$f":"IF(F6=\"\",0,VLOOKUP(F6,Punkte!$A$4:$AC$53,23,FALSE))","v":6},{"$f":"IF(F6=\"\",0,VLOOKUP(F6,Punkte!$A$4:$AC$53,24,FALSE))","v":135.38999999999999},6]
{"$rows_left_out":48}