{"text_format":"1","workbook":"xlsx","n_sheets":5,"sheets":["Einstellungen","Runden","Rang","Punkte","Ergebnis Lauf"],"not_rendered":{"charts":0,"images":0,"macros":1,"external_links":0,"defined_names":15,"comments":1,"pivot_tables":0},"unopened":[],"bounds":{"document_bytes":16777216,"sheet_cells":100000,"rows_first":2000,"rows_last":500,"rows_between":2000,"halvings":0,"cell_chars":16384,"cell_head_chars":4096},"cells_cut":0,"cells_raw":0,"read":"whole","date_system":"1900"}

{"sheet":"Einstellungen","index":0,"n_rows":81,"n_cols":6,"rows_kept":81,"cut":false,"hidden":false,"merged":[[80,3,80,5],[81,3,81,5],[82,3,82,5],[83,3,83,5],[84,3,84,5],[77,3,77,5],[78,3,78,5],[79,3,79,5],[19,3,19,5],[72,3,72,5],[73,3,73,5],[74,3,74,5],[75,3,75,5],[76,3,76,5],[61,3,61,5],[59,3,59,5],[45,3,45,5],[55,3,55,5],[57,3,57,5],[56,3,56,5],[44,3,44,5],[60,3,60,5],[33,3,33,5],[36,3,36,5],[37,3,37,5],[38,3,38,5],[34,3,34,5],[41,3,41,5],[42,3,42,5],[48,3,48,5],[51,3,51,5],[52,3,52,5],[54,3,54,5],[47,3,47,5],[43,3,43,5],[35,3,35,5],[64,3,64,5],[62,3,62,5],[63,3,63,5],[65,3,65,5],[66,3,66,5],[71,3,71,5],[67,3,67,5],[69,3,69,5],[70,3,70,5],[68,3,68,5],[0,0,0,1],[1,3,1,4],[7,3,7,4],[8,3,8,4],[21,3,21,5],[14,3,14,5],[13,3,13,5],[12,3,12,5],[20,3,20,5],[16,3,16,5],[17,3,17,5],[18,3,18,5],[15,3,15,5],[26,3,26,5],[27,3,27,5],[29,3,29,5],[40,3,40,5],[22,3,22,5],[31,3,31,5],[28,3,28,5],[25,3,25,5],[30,3,30,5],[39,3,39,5]]}
["Punktevergabe",null,null,null,null,"      Bezeichnung: Rennserienvorlage 50TNx20L-EL      Stand: 01.12.2015"]
["Rang","Punkte",null,"Anzahl der",null,"     Funktionsumfang:"]
[1,20,null,"Läufe insgesamt:",10,"     Die Vorlage kann verwendet werden für:"]
[2,18,null,"erforderl. Wertungsläufe:",1,"     - max. 50 Teilnehmer"]
[3,16,null,"Steichergebnisse:",3,"     - max. 20 Läufe"]
[4,15,null,"Rang bei Punktegleichstand:","unverändert","     Die Vergabe von Zusatzpunkten ist nicht möglich."]
[5,14,null,null,null,"     "]
[6,13,null,"Bezeichnung der Rennserie:",null,"     Wichtig:"]
[7,12,null,"DTM2019",null,"     Vorlage funktioniert nur, wenn Makros aktiviert sind!"]
[8,11]
[9,10,null,"Start der Rennserie (Datum):","2018-12-04"]
[10,9,null,"Wiederholung in Tagen:",28]
[11,8]
[12,7,null,"Allgemeines:"]
[13,6,null,"Gelb hinterlegte Felder sind Eingabefelder. Bei Fehlern wechselt die Hintergrund- oder Schriftfarbe auf Rot."]
[14,5,null,"Nullwerte werden nicht angezeigt."]
[15,4,null,"Außerhalb der Eingabefelder dürfen in keiner Tabelle Änderungen vorgenommen werden."]
[16,3,null,"Bei Fehlanzeigen überprüfen Sie, ob die Eingaben in den Tabellen \"Einstellungen\" und \"Runden\" korrekt sind. "]
[17,2,null,"Außer zu \"Bezeichnung der Rennserie\", \"Teilnehmer\" und \"Datum\" sind nur numerische Daten zulässig!"]
[18,1]
[19,1,null,"Punktevergabe:"]
[20,1,null,"Die vorgegebenen Punkte können geändert werden. "]
[21,1,null,"Jede Änderung während einer Rennserie bewirkt eine Neuberechnung der gesamten Punktetabelle."]
[22,1]
[23,1,null,"Läufe insgesamt:"]
[24,1,null,"Entsprechend der eingebenen Anzahl werden in den Tabellen \"Runden\" und \"Punkte\" die erforderlichen"]
[25,1,null,"Spalten eingerichtet. Eine nachträgliche Reduzierung der Anzahl der Läufe wirkt sich nur auf die Läufe aus,"]
[26,1,null,"zu denen noch keine Ergebnisse erfasst sind."]
[27,1]
[28,1,null,"\"erforderliche Wertungen\" und \"Streichergebnisse\":"]
[29,1,null,"In der Punktetabelle wird neben der Summe der Punkte aller Läufe (Ergebnis aus allen Läufen) auch der "]
[30,1,null,"Endstand berechnet. Fahrer, die nicht mindestens an der vorgegebenen Anzahl von Läufen teilgenommen "]
[31,1,null,"haben, werden im \"Endstand\" nicht berücksichtigt."]
[32,1,null,"Die Berechnung des \"Endstandes\" erfolgt unter Berücksichtigung der vorgegebenen Anzahl der Steicher-"]
[33,1,null,"gebnisse."]
[34,1]
[35,1,null,"Rang bei Punktegleichstand:"]
[36,1,null,"Bei gleichem Punktestand entscheidet über die bessere Platzierung bei Einstellung"]
[37,1,null,"- Gesamtrunden:  die größere Anzahl der Gesamtrunden"]
[38,1,null,"- bester Platz:      die Anzahl der besseren Platzierungen (bis einschl. Platz 24)"]
[39,1,null,"- unverändert:      bei gleichem Punktestand wird auch die gleiche Platzierung vergeben"]
[40,1,null,"\"Gesamtrunden\" und \"bester Platz\" berücksichtigen unabhängig von der Anzahl der Streicher die Ergebnisse"]
[41,1,null,"aus allen Läufen."]
[42,1]
[43,1,null,"Bezeichnung der Rennserie:"]
[44,1,null,"Die hier eingegebene Bezeichnung wird in die Tabellen \"Runden\" und \"Punkte\" übernommen."]
[45,1]
[46,1,null,"Datum des Laufes in den Tabellen \"Runden\" und \"Punkte\":"]
[47,1,null,"Ein in der Tabelle \"Runden\" eingegebenes Datum des Laufes wird in die Tabelle \"Punkte\" übernommen."]
[48,1]
[49,1,null,"Automatische Sortierung:"]
[50,1,null,"Die Tabellen \"Punkte\" und \"Ergebnis Lauf\" werden automatisch nach dem aktuellen Stand sortiert."]
[null,null,null,"Mit dem letzten Lauf wird die Tabelle \"Punkte\" nach dem Endstand sortiert."]
[]
[null,null,null,"Manuelle Sortierung:"]
[null,null,null,"In eine beliebige Zelle der Spalte, die sortiert werden soll, klicken und auf die Schaltfläche \"Sortieren\" klicken. "]
[null,null,null,"In der Tabelle \"Runden\" können nur die Spalten \"Name\" und \"Ges-Runden\" sortiert werden. "]
[null,null,null,"Die Tabelle \"Ergenis Lauf\" kann nicht sortiert werden."]
[]
[null,null,null,"Schaltfläche \"gelöscht\" in der Rundentabelle:"]
[null,null,null,"Fahrer, die an mindestens einem Lauf teilgenommen haben, können nicht gelöscht werden, da sich sonst die"]
[null,null,null,"Punkte aller Teilnehmer ändern würden. Fahrer mit Ergebnissen werden daher nicht endgültig gelöscht, son-"]
[null,null,null,"dern in den Tabellen ausgeblendet."]
[null,null,null,"Wollen Sie einen ausgeblendeten Fahrer wieder in den Tabellen anzeigen, gehen sie wie folgt vor:"]
[null,null,null,"1. Schaltfläche \"gelöscht\" anklicken (es werden alle Teilnehmer angezeigt, die ausgeblendet waren)"]
[null,null,null,"2. Klicken Sie doppelt auf den Fahrer, der in den Tabellen wieder eingeblendet werden soll"]
[null,null,null,"3. Löschen Sie den Zusatz \" (gelöscht)\""]
[null,null,null,"4. Klicken Sie auf die Schaltfläche \"gelöscht\" (Danach wird wieder die vollständige Eingabetabelle angezeigt)"]
[]
[null,null,null,"Tabelle \"Punkte\":"]
[null,null,null,"Leere Zeilen und \"gelöschte Teilnehmer\" werden nicht angezeigt."]
[null,null,null,"Die Ergebnisse werden ausschließlich auf der Grundlage der Eingaben in der Tabelle \"Runden\" berechnet."]
[]
[null,null,null,"Tabelle \"Ergebnis Lauf\""]
[null,null,null,"Eingaben sind nicht möglich. Es werden lediglich Daten aus den übrigen Tabellenblättern zusammengefasst."]
[null,null,null,"Aus dem linken Teil ergeben sich alle Daten des letzten Laufes. Fahrer, die am letzten Lauf nicht teilgenommen"]
[null,null,null,"haben, sind in der Reihenfolge ihrer Platzierung angefügt. Dadurch ergibt sich die Startaufstellung für den"]
[null,null,null,"nächsten Lauf."]
[null,null,null,"Aus dem rechten Teil ergibt sich die aktuelle Platzierung aller Teilnehmer."]
[null,null,null,"Hierbei werden weder \"Streichergebnisse\" noch die \"Anzahl erforderlicher Wertungsläufe\" berücksichtigt."]
[null,null,null,"Der \"Endstand\" unter Berücksichtigung dieser Faktoren ergibt sich ausschließlich aus der Tabelle \"Punkte\"."]

{"sheet":"Runden","index":1,"n_rows":54,"n_cols":25,"rows_kept":54,"cut":false,"hidden":false,"merged":[]}
[{"$f":"Einstellungen!D9&\" (gefahrene Runden)\"","v":"DTM2019 (gefahrene Runden)"}]
[null,"1. Lauf","2. Lauf","3. Lauf","4. Lauf","5. Lauf","6. Lauf","7. Lauf","8. Lauf","9. Lauf","10. Lauf","11. Lauf","12. Lauf","13. Lauf","14. Lauf","15. Lauf","16. Lauf","17. Lauf","18. Lauf","19. Lauf","20. Lauf","Gesamt-","Platz aus"]
["Teilnehmer  /   Datum",{"$f":"Startdatum","v":"2018-12-04"},{"$f":"B3+IF(B3>0,Wiederholung,)","v":"2019-01-01"},"2019-01-29","2019-02-26","2019-03-26","2019-04-23","2019-05-21","2019-06-18","2019-07-16","2019-08-13","2019-09-10","2019-10-08","2019-11-05","2019-12-03","2019-12-31","2020-01-28","2020-02-25","2020-03-24","2020-04-21","2020-05-19","Runden","Runden"]
["Ronald",134.65,null,null,null,null,null,null,null,null,null,null,null,null,null,null,null,null,null,null,null,{"$f":"SUM(B4:U4)","v":134.65},{"$f":"IF(V4>0,RANK(V4,$V$4:$V$53,0),0)","v":7}]
["Günter",136.03,null,null,null,null,null,null,null,null,null,null,null,null,null,null,null,null,null,null,null,136.03,5]
["Marcus",135.38999999999999,null,null,null,null,null,null,null,null,null,null,null,null,null,null,null,null,null,null,null,135.38999999999999,6]
["Dietmar",null,null,null,null,null,null,null,null,null,null,null,null,null,null,null,null,null,null,null,null,0,0]
["Hans",137.30000000000001,null,null,null,null,null,null,null,null,null,null,null,null,null,null,null,null,null,null,null,137.30000000000001,4]
["Chris",139.4,null,null,null,null,null,null,null,null,null,null,null,null,null,null,null,null,null,null,null,139.4,2]
["Ewald",143.05000000000001,null,null,null,null,null,null,null,null,null,null,null,null,null,null,null,null,null,null,null,143.05000000000001,1]
["Sven",null,null,null,null,null,null,null,null,null,null,null,null,null,null,null,null,null,null,null,null,0,0]
["Thomas G.",117.71,null,null,null,null,null,null,null,null,null,null,null,null,null,null,null,null,null,null,null,117.71,10]
["Thomas S.",120.57,null,null,null,null,null,null,null,null,null,null,null,null,null,null,null,null,null,null,null,120.57,9]
["Thomas V.",138.22,null,null,null,null,null,null,null,null,null,null,null,null,null,null,null,null,null,null,null,138.22,3]
["Christoph",124.57,null,null,null,null,null,null,null,null,null,null,null,null,null,null,null,null,null,null,null,124.57,8]
["Olli",null,null,null,null,null,null,null,null,null,null,null,null,null,null,null,null,null,null,null,null,0,0]
["Horst",null,null,null,null,null,null,null,null,null,null,null,null,null,null,null,null,null,null,null,null,0,0]
[null,null,null,null,null,null,null,null,null,null,null,null,null,null,null,null,null,null,null,null,null,0,0]
[null,null,null,null,null,null,null,null,null,null,null,null,null,null,null,null,null,null,null,null,null,0,0]
[null,null,null,null,null,null,null,null,null,null,null,null,null,null,null,null,null,null,null,null,null,{"$f":"SUM(B20:U20)","v":0},{"$f":"IF(V20>0,RANK(V20,$V$4:$V$53,0),0)","v":0}]
[null,null,null,null,null,null,null,null,null,null,null,null,null,null,null,null,null,null,null,null,null,0,0]
[null,null,null,null,null,null,null,null,null,null,null,null,null,null,null,null,null,null,null,null,null,0,0]
[null,null,null,null,null,null,null,null,null,null,null,null,null,null,null,null,null,null,null,null,null,0,0]
[null,null,null,null,null,null,null,null,null,null,null,null,null,null,null,null,null,null,null,null,null,0,0]
[null,null,null,null,null,null,null,null,null,null,null,null,null,null,null,null,null,null,null,null,null,0,0]
[null,null,null,null,null,null,null,null,null,null,null,null,null,null,null,null,null,null,null,null,null,0,0]
[null,null,null,null,null,null,null,null,null,null,null,null,null,null,null,null,null,null,null,null,null,0,0]
[null,null,null,null,null,null,null,null,null,null,null,null,null,null,null,null,null,null,null,null,null,0,0]
[null,null,null,null,null,null,null,null,null,null,null,null,null,null,null,null,null,null,null,null,null,0,0]
[null,null,null,null,null,null,null,null,null,null,null,null,null,null,null,null,null,null,null,null,null,0,0]
[null,null,null,null,null,null,null,null,null,null,null,null,null,null,null,null,null,null,null,null,null,0,0]
[null,null,null,null,null,null,null,null,null,null,null,null,null,null,null,null,null,null,null,null,null,0,0]
[null,null,null,null,null,null,null,null,null,null,null,null,null,null,null,null,null,null,null,null,null,0,0]
[null,null,null,null,null,null,null,null,null,null,null,null,null,null,null,null,null,null,null,null,null,0,0]
[null,null,null,null,null,null,null,null,null,null,null,null,null,null,null,null,null,null,null,null,null,0,0]
[null,null,null,null,null,null,null,null,null,null,null,null,null,null,null,null,null,null,null,null,null,0,{"$f":"IF(V36>0,RANK(V36,$V$4:$V$53,0),0)","v":0}]
[null,null,null,null,null,null,null,null,null,null,null,null,null,null,null,null,null,null,null,null,null,0,0]
[null,null,null,null,null,null,null,null,null,null,null,null,null,null,null,null,null,null,null,null,null,0,0]
[null,null,null,null,null,null,null,null,null,null,null,null,null,null,null,null,null,null,null,null,null,0,0]
[null,null,null,null,null,null,null,null,null,null,null,null,null,null,null,null,null,null,null,null,null,0,0]
[null,null,null,null,null,null,null,null,null,null,null,null,null,null,null,null,null,null,null,null,null,0,0]
[null,null,null,null,null,null,null,null,null,null,null,null,null,null,null,null,null,null,null,null,null,0,0]
[null,null,null,null,null,null,null,null,null,null,null,null,null,null,null,null,null,null,null,null,null,0,0]
[null,null,null,null,null,null,null,null,null,null,null,null,null,null,null,null,null,null,null,null,null,0,0]
[null,null,null,null,null,null,null,null,null,null,null,null,null,null,null,null,null,null,null,null,null,0,0]
[null,null,null,null,null,null,null,null,null,null,null,null,null,null,null,null,null,null,null,null,null,0,0]
[null,null,null,null,null,null,null,null,null,null,null,null,null,null,null,null,null,null,null,null,null,0,0]
[null,null,null,null,null,null,null,null,null,null,null,null,null,null,null,null,null,null,null,null,null,0,0]
[null,null,null,null,null,null,null,null,null,null,null,null,null,null,null,null,null,null,null,null,null,0,0]
[null,null,null,null,null,null,null,null,null,null,null,null,null,null,null,null,null,null,null,null,null,0,0]
[null,null,null,null,null,null,null,null,null,null,null,null,null,null,null,null,null,null,null,null,null,0,0]
[null,null,null,null,null,null,null,null,null,null,null,null,null,null,null,null,null,null,null,null,null,0,0]
[null,null,null,null,null,null,null,null,null,null,null,null,null,null,null,null,null,null,null,null,null,0,0,null,"Anzahl der durchgeführten Läufe:"]
[{"$f":"COUNTA(A4:A53)","v":14},{"$f":"COUNTA(B4:B53)","v":10},{"$f":"COUNTA(C4:C53)","v":0},0,0,0,0,0,0,0,{"$f":"COUNTA(K4:K53)","v":0},0,0,0,0,0,0,0,0,0,0,null,null,null,{"$f":"COUNTIF(B54:U54,\">0\")","v":1}]

{"sheet":"Rang","index":2,"n_rows":53,"n_cols":82,"rows_kept":53,"cut":false,"hidden":true,"merged":[]}
[{"$f":"Einstellungen!D9&\" (Rang)\"","v":"DTM2019 (Rang)"},null,null,null,null,null,null,null,null,null,null,null,null,null,null,null,null,null,null,null,null,null,null,null,null,null,null,null,null,null,null,null,null,null,null,null,null,null,null,null,null,null,null,null,null,null,"Wiederholung: Rang",null,null,null,null,null,null,null,null,null,"aufsteigender",null,null,null,null,null,null,null,null,null,null,"aufsteigender",null,null,null,null,null,null,null,null,null,null,"aufsteigender",null,"Platzierungs-","absteigender Rang"]
["Anzahl Teilnehmer:",{"$f":"50-COUNTIF(B4:B53,0)","v":10},{"$f":"50-COUNTIF(C4:C53,0)","v":0},0,0,0,0,0,0,0,0,0,0,0,0,0,0,0,0,0,0,null,"Anzahl Platzierung",null,null,null,null,null,null,null,null,null,null,null,null,null,null,null,null,null,null,null,null,null,null,null,"aus Platzierungswerten","Wert der ersten 8 Platzierungen",null,null,null,null,null,null,null,null,"Rang aus",null,"Wert der Platzierungen 9-16",null,null,null,null,null,null,null,null,"Rang aus",null,"Wert der Platzierungen 17-24",null,null,null,null,null,null,null,null,"Rang aus",null,"wert aus den","aus Platzierungs-"]
["Namen","1. Lauf","2. Lauf","3. Lauf","4. Lauf","5. Lauf","6. Lauf","7. Lauf","8. Lauf","9. Lauf","10. Lauf","11. Lauf","12. Lauf","13. Lauf","14. Lauf","15. Lauf","16. Lauf","17. Lauf","18. Lauf","19. Lauf","20. Lauf",null,1,2,3,4,5,6,7,8,9,10,11,12,13,14,15,16,17,18,19,20,21,22,23,24,"(aus Spalte \"CD\")",1,2,3,4,5,6,7,8,"Summe","Summe",null,9,10,11,12,13,14,15,16,"Summe","Summe",null,17,18,19,20,21,22,23,24,"Summe","Summe",null,"Plätzen 1-24","werten"]
[{"$f":"IF(Runden!A4=\"\",\"\",Runden!A4)","v":"Ronald"},{"$f":"IF(Runden!B4>0,RANK(Runden!B4,Runden!B$4:B$53,0),0)","v":7},{"$f":"IF(Runden!C4>0,RANK(Runden!C4,Runden!C$4:C$53,0),0)","v":0},{"$f":"IF(Runden!D4>0,RANK(Runden!D4,Runden!D$4:D$53,0),0)","v":0},{"$f":"IF(Runden!E4>0,RANK(Runden!E4,Runden!E$4:E$53,0),0)","v":0},{"$f":"IF(Runden!F4>0,RANK(Runden!F4,Runden!F$4:F$53,0),0)","v":0},{"$f":"IF(Runden!G4>0,RANK(Runden!G4,Runden!G$4:G$53,0),0)","v":0},{"$f":"IF(Runden!H4>0,RANK(Runden!H4,Runden!H$4:H$53,0),0)","v":0},{"$f":"IF(Runden!I4>0,RANK(Runden!I4,Runden!I$4:I$53,0),0)","v":0},{"$f":"IF(Runden!J4>0,RANK(Runden!J4,Runden!J$4:J$53,0),0)","v":0},{"$f":"IF(Runden!K4>0,RANK(Runden!K4,Runden!K$4:K$53,0),0)","v":0},{"$f":"IF(Runden!L4>0,RANK(Runden!L4,Runden!L$4:L$53,0),0)","v":0},{"$f":"IF(Runden!M4>0,RANK(Runden!M4,Runden!M$4:M$53,0),0)","v":0},{"$f":"IF(Runden!N4>0,RANK(Runden!N4,Runden!N$4:N$53,0),0)","v":0},{"$f":"IF(Runden!O4>0,RANK(Runden!O4,Runden!O$4:O$53,0),0)","v":0},{"$f":"IF(Runden!P4>0,RANK(Runden!P4,Runden!P$4:P$53,0),0)","v":0},{"$f":"IF(Runden!Q4>0,RANK(Runden!Q4,Runden!Q$4:Q$53,0),0)","v":0},{"$f":"IF(Runden!R4>0,RANK(Runden!R4,Runden!R$4:R$53,0),0)","v":0},{"$f":"IF(Runden!S4>0,RANK(Runden!S4,Runden!S$4:S$53,0),0)","v":0},{"$f":"IF(Runden!T4>0,RANK(Runden!T4,Runden!T$4:T$53,0),0)","v":0},{"$f":"IF(Runden!U4>0,RANK(Runden!U4,Runden!U$4:U$53,0),0)","v":0},null,{"$f":"COUNTIF($B4:$U4,W$3)","v":0},{"$f":"COUNTIF($B4:$U4,X$3)","v":0},0,0,0,0,1,0,0,0,0,0,0,0,0,0,0,0,0,{"$f":"COUNTIF($B4:$U4,AP$3)","v":0},0,0,0,0,{"$f":"CD4","v":44},{"$f":"W4%","v":0},{"$f":"X4%%","v":0},{"$f":"Y4%%%","v":0},{"$f":"Z4%%%%","v":0},{"$f":"AA4%%%%%","v":0},{"$f":"AB4%%%%%%","v":0},{"$f":"AC4%%%%%%%","v":1E-14},{"$f":"AD4%%%%%%%%","v":0},{"$f":"SUM(AV4:BC4)","v":1E-14},{"$f":"IF(BD4=0,0,RANK(BD4,$BD$4:$BD$53,1))","v":44},{"$f":"BE4/1000","v":4.3999999999999997E-2},{"$f":"AE4%","v":0},{"$f":"AF4%%","v":0},{"$f":"AG4%%%","v":0},{"$f":"AH4%%%%","v":0},{"$f":"AI4%%%%%","v":0},{"$f":"AJ4%%%%%%","v":0},{"$f":"AK4%%%%%%%","v":0},{"$f":"AL4%%%%%%%%","v":0},{"$f":"SUM(BG4:BN4)","v":0},{"$f":"IF(BO4=0,0,RANK(BO4,$BO$4:$BO$53,1))","v":0},{"$f":"BP4/100000","v":0},{"$f":"AM4%","v":0},{"$f":"AN4%%","v":0},{"$f":"AO4%%%","v":0},{"$f":"AP4%%%%","v":0},{"$f":"AQ4%%%%%","v":0},{"$f":"AR4%%%%%%","v":0},{"$f":"AS4%%%%%%%","v":0},{"$f":"AT4%%%%%%%%","v":0},{"$f":"SUM(BR4:BY4)","v":0},{"$f":"IF(BZ4=0,0,RANK(BZ4,$BZ$4:$BZ$53,1))","v":0},{"$f":"CA4/10000000","v":0},{"$f":"BF4+BQ4+CB4","v":4.3999999999999997E-2},{"$f":"RANK(CC4,$CC$4:$CC$53,1)","v":44}]
[{"$f":"IF(Runden!A5=\"\",\"\",Runden!A5)","v":"Günter"},{"$f":"IF(Runden!B5>0,RANK(Runden!B5,Runden!B$4:B$53,0),0)","v":5},{"$f":"IF(Runden!C5>0,RANK(Runden!C5,Runden!C$4:C$53,0),0)","v":0},{"$f":"IF(Runden!D5>0,RANK(Runden!D5,Runden!D$4:D$53,0),0)","v":0},{"$f":"IF(Runden!E5>0,RANK(Runden!E5,Runden!E$4:E$53,0),0)","v":0},{"$f":"IF(Runden!F5>0,RANK(Runden!F5,Runden!F$4:F$53,0),0)","v":0},{"$f":"IF(Runden!G5>0,RANK(Runden!G5,Runden!G$4:G$53,0),0)","v":0},{"$f":"IF(Runden!H5>0,RANK(Runden!H5,Runden!H$4:H$53,0),0)","v":0},{"$f":"IF(Runden!I5>0,RANK(Runden!I5,Runden!I$4:I$53,0),0)","v":0},{"$f":"IF(Runden!J5>0,RANK(Runden!J5,Runden!J$4:J$53,0),0)","v":0},{"$f":"IF(Runden!K5>0,RANK(Runden!K5,Runden!K$4:K$53,0),0)","v":0},{"$f":"IF(Runden!L5>0,RANK(Runden!L5,Runden!L$4:L$53,0),0)","v":0},{"$f":"IF(Runden!M5>0,RANK(Runden!M5,Runden!M$4:M$53,0),0)","v":0},{"$f":"IF(Runden!N5>0,RANK(Runden!N5,Runden!N$4:N$53,0),0)","v":0},{"$f":"IF(Runden!O5>0,RANK(Runden!O5,Runden!O$4:O$53,0),0)","v":0},{"$f":"IF(Runden!P5>0,RANK(Runden!P5,Runden!P$4:P$53,0),0)","v":0},{"$f":"IF(Runden!Q5>0,RANK(Runden!Q5,Runden!Q$4:Q$53,0),0)","v":0},{"$f":"IF(Runden!R5>0,RANK(Runden!R5,Runden!R$4:R$53,0),0)","v":0},{"$f":"IF(Runden!S5>0,RANK(Runden!S5,Runden!S$4:S$53,0),0)","v":0},{"$f":"IF(Runden!T5>0,RANK(Runden!T5,Runden!T$4:T$53,0),0)","v":0},{"$f":"IF(Runden!U5>0,RANK(Runden!U5,Runden!U$4:U$53,0),0)","v":0},null,{"$f":"COUNTIF($B5:$U5,W$3)","v":0},0,0,0,1,0,0,0,0,0,0,0,0,0,0,0,0,0,0,0,0,0,0,0,{"$f":"CD5","v":46},{"$f":"W5%","v":0},{"$f":"X5%%","v":0},{"$f":"Y5%%%","v":0},{"$f":"Z5%%%%","v":0},{"$f":"AA5%%%%%","v":1E-10},{"$f":"AB5%%%%%%","v":0},{"$f":"AC5%%%%%%%","v":0},{"$f":"AD5%%%%%%%%","v":0},1E-10,{"$f":"IF(BD5=0,0,RANK(BD5,$BD$4:$BD$53,1))","v":46},{"$f":"BE5/1000","v":4.5999999999999999E-2},{"$f":"AE5%","v":0},{"$f":"AF5%%","v":0},{"$f":"AG5%%%","v":0},{"$f":"AH5%%%%","v":0},{"$f":"AI5%%%%%","v":0},{"$f":"AJ5%%%%%%","v":0},{"$f":"AK5%%%%%%%","v":0},{"$f":"AL5%%%%%%%%","v":0},0,{"$f":"IF(BO5=0,0,RANK(BO5,$BO$4:$BO$53,1))","v":0},{"$f":"BP5/100000","v":0},{"$f":"AM5%","v":0},{"$f":"AN5%%","v":0},{"$f":"AO5%%%","v":0},{"$f":"AP5%%%%","v":0},{"$f":"AQ5%%%%%","v":0},{"$f":"AR5%%%%%%","v":0},{"$f":"AS5%%%%%%%","v":0},{"$f":"AT5%%%%%%%%","v":0},0,{"$f":"IF(BZ5=0,0,RANK(BZ5,$BZ$4:$BZ$53,1))","v":0},{"$f":"CA5/10000000","v":0},{"$f":"BF5+BQ5+CB5","v":4.5999999999999999E-2},{"$f":"RANK(CC5,$CC$4:$CC$53,1)","v":46}]
[{"$f":"IF(Runden!A6=\"\",\"\",Runden!A6)","v":"Marcus"},{"$f":"IF(Runden!B6>0,RANK(Runden!B6,Runden!B$4:B$53,0),0)","v":6},{"$f":"IF(Runden!C6>0,RANK(Runden!C6,Runden!C$4:C$53,0),0)","v":0},{"$f":"IF(Runden!D6>0,RANK(Runden!D6,Runden!D$4:D$53,0),0)","v":0},{"$f":"IF(Runden!E6>0,RANK(Runden!E6,Runden!E$4:E$53,0),0)","v":0},{"$f":"IF(Runden!F6>0,RANK(Runden!F6,Runden!F$4:F$53,0),0)","v":0},{"$f":"IF(Runden!G6>0,RANK(Runden!G6,Runden!G$4:G$53,0),0)","v":0},{"$f":"IF(Runden!H6>0,RANK(Runden!H6,Runden!H$4:H$53,0),0)","v":0},{"$f":"IF(Runden!I6>0,RANK(Runden!I6,Runden!I$4:I$53,0),0)","v":0},{"$f":"IF(Runden!J6>0,RANK(Runden!J6,Runden!J$4:J$53,0),0)","v":0},{"$f":"IF(Runden!K6>0,RANK(Runden!K6,Runden!K$4:K$53,0),0)","v":0},{"$f":"IF(Runden!L6>0,RANK(Runden!L6,Runden!L$4:L$53,0),0)","v":0},{"$f":"IF(Runden!M6>0,RANK(Runden!M6,Runden!M$4:M$53,0),0)","v":0},{"$f":"IF(Runden!N6>0,RANK(Runden!N6,Runden!N$4:N$53,0),0)","v":0},{"$f":"IF(Runden!O6>0,RANK(Runden!O6,Runden!O$4:O$53,0),0)","v":0},{"$f":"IF(Runden!P6>0,RANK(Runden!P6,Runden!P$4:P$53,0),0)","v":0},{"$f":"IF(Runden!Q6>0,RANK(Runden!Q6,Runden!Q$4:Q$53,0),0)","v":0},{"$f":"IF(Runden!R6>0,RANK(Runden!R6,Runden!R$4:R$53,0),0)","v":0},{"$f":"IF(Runden!S6>0,RANK(Runden!S6,Runden!S$4:S$53,0),0)","v":0},{"$f":"IF(Runden!T6>0,RANK(Runden!T6,Runden!T$4:T$53,0),0)","v":0},{"$f":"IF(Runden!U6>0,RANK(Runden!U6,Runden!U$4:U$53,0),0)","v":0},null,0,0,0,0,0,1,0,0,0,0,0,0,0,0,0,0,0,0,0,0,0,0,0,0,{"$f":"CD6","v":45},0,0,0,0,0,9.9999999999999998E-13,0,0,9.9999999999999998E-13,45,4.4999999999999998E-2,0,0,0,0,0,0,0,0,0,0,0,0,0,0,0,0,0,0,0,0,0,0,4.4999999999999998E-2,45]
[{"$f":"IF(Runden!A7=\"\",\"\",Runden!A7)","v":"Dietmar"},{"$f":"IF(Runden!B7>0,RANK(Runden!B7,Runden!B$4:B$53,0),0)","v":0},{"$f":"IF(Runden!C7>0,RANK(Runden!C7,Runden!C$4:C$53,0),0)","v":0},{"$f":"IF(Runden!D7>0,RANK(Runden!D7,Runden!D$4:D$53,0),0)","v":0},{"$f":"IF(Runden!E7>0,RANK(Runden!E7,Runden!E$4:E$53,0),0)","v":0},{"$f":"IF(Runden!F7>0,RANK(Runden!F7,Runden!F$4:F$53,0),0)","v":0},{"$f":"IF(Runden!G7>0,RANK(Runden!G7,Runden!G$4:G$53,0),0)","v":0},{"$f":"IF(Runden!H7>0,RANK(Runden!H7,Runden!H$4:H$53,0),0)","v":0},{"$f":"IF(Runden!I7>0,RANK(Runden!I7,Runden!I$4:I$53,0),0)","v":0},{"$f":"IF(Runden!J7>0,RANK(Runden!J7,Runden!J$4:J$53,0),0)","v":0},{"$f":"IF(Runden!K7>0,RANK(Runden!K7,Runden!K$4:K$53,0),0)","v":0},{"$f":"IF(Runden!L7>0,RANK(Runden!L7,Runden!L$4:L$53,0),0)","v":0},{"$f":"IF(Runden!M7>0,RANK(Runden!M7,Runden!M$4:M$53,0),0)","v":0},{"$f":"IF(Runden!N7>0,RANK(Runden!N7,Runden!N$4:N$53,0),0)","v":0},{"$f":"IF(Runden!O7>0,RANK(Runden!O7,Runden!O$4:O$53,0),0)","v":0},{"$f":"IF(Runden!P7>0,RANK(Runden!P7,Runden!P$4:P$53,0),0)","v":0},{"$f":"IF(Runden!Q7>0,RANK(Runden!Q7,Runden!Q$4:Q$53,0),0)","v":0},{"$f":"IF(Runden!R7>0,RANK(Runden!R7,Runden!R$4:R$53,0),0)","v":0},{"$f":"IF(Runden!S7>0,RANK(Runden!S7,Runden!S$4:S$53,0),0)","v":0},{"$f":"IF(Runden!T7>0,RANK(Runden!T7,Runden!T$4:T$53,0),0)","v":0},{"$f":"IF(Runden!U7>0,RANK(Runden!U7,Runden!U$4:U$53,0),0)","v":0},null,0,0,0,0,0,0,0,0,0,0,0,0,0,0,0,0,0,0,0,0,0,0,0,0,1,0,0,0,0,0,0,0,0,0,0,0,0,0,0,0,0,0,0,0,0,0,0,0,0,0,0,0,0,0,0,0,0,0,0,1]
[{"$f":"IF(Runden!A8=\"\",\"\",Runden!A8)","v":"Hans"},{"$f":"IF(Runden!B8>0,RANK(Runden!B8,Runden!B$4:B$53,0),0)","v":4},{"$f":"IF(Runden!C8>0,RANK(Runden!C8,Runden!C$4:C$53,0),0)","v":0},{"$f":"IF(Runden!D8>0,RANK(Runden!D8,Runden!D$4:D$53,0),0)","v":0},{"$f":"IF(Runden!E8>0,RANK(Runden!E8,Runden!E$4:E$53,0),0)","v":0},{"$f":"IF(Runden!F8>0,RANK(Runden!F8,Runden!F$4:F$53,0),0)","v":0},{"$f":"IF(Runden!G8>0,RANK(Runden!G8,Runden!G$4:G$53,0),0)","v":0},{"$f":"IF(Runden!H8>0,RANK(Runden!H8,Runden!H$4:H$53,0),0)","v":0},{"$f":"IF(Runden!I8>0,RANK(Runden!I8,Runden!I$4:I$53,0),0)","v":0},{"$f":"IF(Runden!J8>0,RANK(Runden!J8,Runden!J$4:J$53,0),0)","v":0},{"$f":"IF(Runden!K8>0,RANK(Runden!K8,Runden!K$4:K$53,0),0)","v":0},{"$f":"IF(Runden!L8>0,RANK(Runden!L8,Runden!L$4:L$53,0),0)","v":0},{"$f":"IF(Runden!M8>0,RANK(Runden!M8,Runden!M$4:M$53,0),0)","v":0},{"$f":"IF(Runden!N8>0,RANK(Runden!N8,Runden!N$4:N$53,0),0)","v":0},{"$f":"IF(Runden!O8>0,RANK(Runden!O8,Runden!O$4:O$53,0),0)","v":0},{"$f":"IF(Runden!P8>0,RANK(Runden!P8,Runden!P$4:P$53,0),0)","v":0},{"$f":"IF(Runden!Q8>0,RANK(Runden!Q8,Runden!Q$4:Q$53,0),0)","v":0},{"$f":"IF(Runden!R8>0,RANK(Runden!R8,Runden!R$4:R$53,0),0)","v":0},{"$f":"IF(Runden!S8>0,RANK(Runden!S8,Runden!S$4:S$53,0),0)","v":0},{"$f":"IF(Runden!T8>0,RANK(Runden!T8,Runden!T$4:T$53,0),0)","v":0},{"$f":"IF(Runden!U8>0,RANK(Runden!U8,Runden!U$4:U$53,0),0)","v":0},null,0,0,0,1,0,0,0,0,0,0,0,0,0,0,0,0,0,0,0,0,0,0,0,0,47,0,0,0,1E-8,0,0,0,0,1E-8,47,4.7E-2,0,0,0,0,0,0,0,0,0,0,0,0,0,0,0,0,0,0,0,0,0,0,4.7E-2,47]
[{"$f":"IF(Runden!A9=\"\",\"\",Runden!A9)","v":"Chris"},{"$f":"IF(Runden!B9>0,RANK(Runden!B9,Runden!B$4:B$53,0),0)","v":2},{"$f":"IF(Runden!C9>0,RANK(Runden!C9,Runden!C$4:C$53,0),0)","v":0},{"$f":"IF(Runden!D9>0,RANK(Runden!D9,Runden!D$4:D$53,0),0)","v":0},{"$f":"IF(Runden!E9>0,RANK(Runden!E9,Runden!E$4:E$53,0),0)","v":0},{"$f":"IF(Runden!F9>0,RANK(Runden!F9,Runden!F$4:F$53,0),0)","v":0},{"$f":"IF(Runden!G9>0,RANK(Runden!G9,Runden!G$4:G$53,0),0)","v":0},{"$f":"IF(Runden!H9>0,RANK(Runden!H9,Runden!H$4:H$53,0),0)","v":0},{"$f":"IF(Runden!I9>0,RANK(Runden!I9,Runden!I$4:I$53,0),0)","v":0},{"$f":"IF(Runden!J9>0,RANK(Runden!J9,Runden!J$4:J$53,0),0)","v":0},{"$f":"IF(Runden!K9>0,RANK(Runden!K9,Runden!K$4:K$53,0),0)","v":0},{"$f":"IF(Runden!L9>0,RANK(Runden!L9,Runden!L$4:L$53,0),0)","v":0},{"$f":"IF(Runden!M9>0,RANK(Runden!M9,Runden!M$4:M$53,0),0)","v":0},{"$f":"IF(Runden!N9>0,RANK(Runden!N9,Runden!N$4:N$53,0),0)","v":0},{"$f":"IF(Runden!O9>0,RANK(Runden!O9,Runden!O$4:O$53,0),0)","v":0},{"$f":"IF(Runden!P9>0,RANK(Runden!P9,Runden!P$4:P$53,0),0)","v":0},{"$f":"IF(Runden!Q9>0,RANK(Runden!Q9,Runden!Q$4:Q$53,0),0)","v":0},{"$f":"IF(Runden!R9>0,RANK(Runden!R9,Runden!R$4:R$53,0),0)","v":0},{"$f":"IF(Runden!S9>0,RANK(Runden!S9,Runden!S$4:S$53,0),0)","v":0},{"$f":"IF(Runden!T9>0,RANK(Runden!T9,Runden!T$4:T$53,0),0)","v":0},{"$f":"IF(Runden!U9>0,RANK(Runden!U9,Runden!U$4:U$53,0),0)","v":0},null,0,1,0,0,0,0,0,0,0,0,0,{"$f":"COUNTIF($B9:$U9,AH$3)","v":0},0,0,0,0,0,0,0,0,0,0,0,0,49,0,1E-4,0,0,0,0,0,0,1E-4,49,4.9000000000000002E-2,0,0,0,0,0,0,0,0,0,0,0,0,0,0,0,0,0,0,0,0,0,0,4.9000000000000002E-2,49]
[{"$f":"IF(Runden!A10=\"\",\"\",Runden!A10)","v":"Ewald"},{"$f":"IF(Runden!B10>0,RANK(Runden!B10,Runden!B$4:B$53,0),0)","v":1},{"$f":"IF(Runden!C10>0,RANK(Runden!C10,Runden!C$4:C$53,0),0)","v":0},{"$f":"IF(Runden!D10>0,RANK(Runden!D10,Runden!D$4:D$53,0),0)","v":0},{"$f":"IF(Runden!E10>0,RANK(Runden!E10,Runden!E$4:E$53,0),0)","v":0},{"$f":"IF(Runden!F10>0,RANK(Runden!F10,Runden!F$4:F$53,0),0)","v":0},{"$f":"IF(Runden!G10>0,RANK(Runden!G10,Runden!G$4:G$53,0),0)","v":0},{"$f":"IF(Runden!H10>0,RANK(Runden!H10,Runden!H$4:H$53,0),0)","v":0},{"$f":"IF(Runden!I10>0,RANK(Runden!I10,Runden!I$4:I$53,0),0)","v":0},{"$f":"IF(Runden!J10>0,RANK(Runden!J10,Runden!J$4:J$53,0),0)","v":0},{"$f":"IF(Runden!K10>0,RANK(Runden!K10,Runden!K$4:K$53,0),0)","v":0},{"$f":"IF(Runden!L10>0,RANK(Runden!L10,Runden!L$4:L$53,0),0)","v":0},{"$f":"IF(Runden!M10>0,RANK(Runden!M10,Runden!M$4:M$53,0),0)","v":0},{"$f":"IF(Runden!N10>0,RANK(Runden!N10,Runden!N$4:N$53,0),0)","v":0},{"$f":"IF(Runden!O10>0,RANK(Runden!O10,Runden!O$4:O$53,0),0)","v":0},{"$f":"IF(Runden!P10>0,RANK(Runden!P10,Runden!P$4:P$53,0),0)","v":0},{"$f":"IF(Runden!Q10>0,RANK(Runden!Q10,Runden!Q$4:Q$53,0),0)","v":0},{"$f":"IF(Runden!R10>0,RANK(Runden!R10,Runden!R$4:R$53,0),0)","v":0},{"$f":"IF(Runden!S10>0,RANK(Runden!S10,Runden!S$4:S$53,0),0)","v":0},{"$f":"IF(Runden!T10>0,RANK(Runden!T10,Runden!T$4:T$53,0),0)","v":0},{"$f":"IF(Runden!U10>0,RANK(Runden!U10,Runden!U$4:U$53,0),0)","v":0},null,1,0,0,0,0,0,0,0,0,0,0,0,0,0,0,0,{"$f":"COUNTIF($B10:$U10,AM$3)","v":0},0,0,0,0,0,0,0,50,0.01,0,0,0,0,0,0,0,0.01,50,0.05,0,0,0,0,0,0,0,0,0,0,0,0,0,0,0,0,0,0,0,0,0,0,0.05,50]
[{"$f":"IF(Runden!A11=\"\",\"\",Runden!A11)","v":"Sven"},{"$f":"IF(Runden!B11>0,RANK(Runden!B11,Runden!B$4:B$53,0),0)","v":0},{"$f":"IF(Runden!C11>0,RANK(Runden!C11,Runden!C$4:C$53,0),0)","v":0},{"$f":"IF(Runden!D11>0,RANK(Runden!D11,Runden!D$4:D$53,0),0)","v":0},{"$f":"IF(Runden!E11>0,RANK(Runden!E11,Runden!E$4:E$53,0),0)","v":0},{"$f":"IF(Runden!F11>0,RANK(Runden!F11,Runden!F$4:F$53,0),0)","v":0},{"$f":"IF(Runden!G11>0,RANK(Runden!G11,Runden!G$4:G$53,0),0)","v":0},{"$f":"IF(Runden!H11>0,RANK(Runden!H11,Runden!H$4:H$53,0),0)","v":0},{"$f":"IF(Runden!I11>0,RANK(Runden!I11,Runden!I$4:I$53,0),0)","v":0},{"$f":"IF(Runden!J11>0,RANK(Runden!J11,Runden!J$4:J$53,0),0)","v":0},{"$f":"IF(Runden!K11>0,RANK(Runden!K11,Runden!K$4:K$53,0),0)","v":0},{"$f":"IF(Runden!L11>0,RANK(Runden!L11,Runden!L$4:L$53,0),0)","v":0},{"$f":"IF(Runden!M11>0,RANK(Runden!M11,Runden!M$4:M$53,0),0)","v":0},{"$f":"IF(Runden!N11>0,RANK(Runden!N11,Runden!N$4:N$53,0),0)","v":0},{"$f":"IF(Runden!O11>0,RANK(Runden!O11,Runden!O$4:O$53,0),0)","v":0},{"$f":"IF(Runden!P11>0,RANK(Runden!P11,Runden!P$4:P$53,0),0)","v":0},{"$f":"IF(Runden!Q11>0,RANK(Runden!Q11,Runden!Q$4:Q$53,0),0)","v":0},{"$f":"IF(Runden!R11>0,RANK(Runden!R11,Runden!R$4:R$53,0),0)","v":0},{"$f":"IF(Runden!S11>0,RANK(Runden!S11,Runden!S$4:S$53,0),0)","v":0},{"$f":"IF(Runden!T11>0,RANK(Runden!T11,Runden!T$4:T$53,0),0)","v":0},{"$f":"IF(Runden!U11>0,RANK(Runden!U11,Runden!U$4:U$53,0),0)","v":0},null,0,0,0,0,0,0,0,0,0,0,0,0,0,0,0,0,0,0,0,0,0,0,0,0,1,0,0,0,0,0,0,0,0,0,0,0,0,0,0,0,0,0,0,0,0,0,0,0,0,0,0,0,0,0,0,0,0,0,0,1]
[{"$f":"IF(Runden!A12=\"\",\"\",Runden!A12)","v":"Thomas G."},{"$f":"IF(Runden!B12>0,RANK(Runden!B12,Runden!B$4:B$53,0),0)","v":10},{"$f":"IF(Runden!C12>0,RANK(Runden!C12,Runden!C$4:C$53,0),0)","v":0},{"$f":"IF(Runden!D12>0,RANK(Runden!D12,Runden!D$4:D$53,0),0)","v":0},{"$f":"IF(Runden!E12>0,RANK(Runden!E12,Runden!E$4:E$53,0),0)","v":0},{"$f":"IF(Runden!F12>0,RANK(Runden!F12,Runden!F$4:F$53,0),0)","v":0},{"$f":"IF(Runden!G12>0,RANK(Runden!G12,Runden!G$4:G$53,0),0)","v":0},{"$f":"IF(Runden!H12>0,RANK(Runden!H12,Runden!H$4:H$53,0),0)","v":0},{"$f":"IF(Runden!I12>0,RANK(Runden!I12,Runden!I$4:I$53,0),0)","v":0},{"$f":"IF(Runden!J12>0,RANK(Runden!J12,Runden!J$4:J$53,0),0)","v":0},{"$f":"IF(Runden!K12>0,RANK(Runden!K12,Runden!K$4:K$53,0),0)","v":0},{"$f":"IF(Runden!L12>0,RANK(Runden!L12,Runden!L$4:L$53,0),0)","v":0},{"$f":"IF(Runden!M12>0,RANK(Runden!M12,Runden!M$4:M$53,0),0)","v":0},{"$f":"IF(Runden!N12>0,RANK(Runden!N12,Runden!N$4:N$53,0),0)","v":0},{"$f":"IF(Runden!O12>0,RANK(Runden!O12,Runden!O$4:O$53,0),0)","v":0},{"$f":"IF(Runden!P12>0,RANK(Runden!P12,Runden!P$4:P$53,0),0)","v":0},{"$f":"IF(Runden!Q12>0,RANK(Runden!Q12,Runden!Q$4:Q$53,0),0)","v":0},{"$f":"IF(Runden!R12>0,RANK(Runden!R12,Runden!R$4:R$53,0),0)","v":0},{"$f":"IF(Runden!S12>0,RANK(Runden!S12,Runden!S$4:S$53,0),0)","v":0},{"$f":"IF(Runden!T12>0,RANK(Runden!T12,Runden!T$4:T$53,0),0)","v":0},{"$f":"IF(Runden!U12>0,RANK(Runden!U12,Runden!U$4:U$53,0),0)","v":0},null,0,0,0,0,0,0,0,0,0,1,0,0,0,0,0,0,0,0,0,0,0,0,0,0,41,{"$f":"W12%","v":0},0,0,0,0,0,0,0,0,0,0,0,1E-4,0,0,0,0,0,0,1E-4,49,4.8999999999999998E-4,0,0,0,0,0,0,0,0,0,0,0,4.8999999999999998E-4,41]
[{"$f":"IF(Runden!A13=\"\",\"\",Runden!A13)","v":"Thomas S."},{"$f":"IF(Runden!B13>0,RANK(Runden!B13,Runden!B$4:B$53,0),0)","v":9},{"$f":"IF(Runden!C13>0,RANK(Runden!C13,Runden!C$4:C$53,0),0)","v":0},{"$f":"IF(Runden!D13>0,RANK(Runden!D13,Runden!D$4:D$53,0),0)","v":0},{"$f":"IF(Runden!E13>0,RANK(Runden!E13,Runden!E$4:E$53,0),0)","v":0},{"$f":"IF(Runden!F13>0,RANK(Runden!F13,Runden!F$4:F$53,0),0)","v":0},{"$f":"IF(Runden!G13>0,RANK(Runden!G13,Runden!G$4:G$53,0),0)","v":0},{"$f":"IF(Runden!H13>0,RANK(Runden!H13,Runden!H$4:H$53,0),0)","v":0},{"$f":"IF(Runden!I13>0,RANK(Runden!I13,Runden!I$4:I$53,0),0)","v":0},{"$f":"IF(Runden!J13>0,RANK(Runden!J13,Runden!J$4:J$53,0),0)","v":0},{"$f":"IF(Runden!K13>0,RANK(Runden!K13,Runden!K$4:K$53,0),0)","v":0},{"$f":"IF(Runden!L13>0,RANK(Runden!L13,Runden!L$4:L$53,0),0)","v":0},{"$f":"IF(Runden!M13>0,RANK(Runden!M13,Runden!M$4:M$53,0),0)","v":0},{"$f":"IF(Runden!N13>0,RANK(Runden!N13,Runden!N$4:N$53,0),0)","v":0},{"$f":"IF(Runden!O13>0,RANK(Runden!O13,Runden!O$4:O$53,0),0)","v":0},{"$f":"IF(Runden!P13>0,RANK(Runden!P13,Runden!P$4:P$53,0),0)","v":0},{"$f":"IF(Runden!Q13>0,RANK(Runden!Q13,Runden!Q$4:Q$53,0),0)","v":0},{"$f":"IF(Runden!R13>0,RANK(Runden!R13,Runden!R$4:R$53,0),0)","v":0},{"$f":"IF(Runden!S13>0,RANK(Runden!S13,Runden!S$4:S$53,0),0)","v":0},{"$f":"IF(Runden!T13>0,RANK(Runden!T13,Runden!T$4:T$53,0),0)","v":0},{"$f":"IF(Runden!U13>0,RANK(Runden!U13,Runden!U$4:U$53,0),0)","v":0},null,0,0,0,0,0,0,0,0,1,0,0,0,0,0,0,0,0,0,0,0,0,0,0,0,42,0,0,0,0,0,0,0,0,0,{"$f":"IF(BD13=0,0,RANK(BD13,$BD$4:$BD$53,1))","v":0},0,0.01,0,0,0,0,0,0,0,0.01,50,5.0000000000000001E-4,0,0,0,0,0,0,0,0,0,0,0,5.0000000000000001E-4,42]
[{"$f":"IF(Runden!A14=\"\",\"\",Runden!A14)","v":"Thomas V."},{"$f":"IF(Runden!B14>0,RANK(Runden!B14,Runden!B$4:B$53,0),0)","v":3},{"$f":"IF(Runden!C14>0,RANK(Runden!C14,Runden!C$4:C$53,0),0)","v":0},{"$f":"IF(Runden!D14>0,RANK(Runden!D14,Runden!D$4:D$53,0),0)","v":0},{"$f":"IF(Runden!E14>0,RANK(Runden!E14,Runden!E$4:E$53,0),0)","v":0},{"$f":"IF(Runden!F14>0,RANK(Runden!F14,Runden!F$4:F$53,0),0)","v":0},{"$f":"IF(Runden!G14>0,RANK(Runden!G14,Runden!G$4:G$53,0),0)","v":0},{"$f":"IF(Runden!H14>0,RANK(Runden!H14,Runden!H$4:H$53,0),0)","v":0},{"$f":"IF(Runden!I14>0,RANK(Runden!I14,Runden!I$4:I$53,0),0)","v":0},{"$f":"IF(Runden!J14>0,RANK(Runden!J14,Runden!J$4:J$53,0),0)","v":0},{"$f":"IF(Runden!K14>0,RANK(Runden!K14,Runden!K$4:K$53,0),0)","v":0},{"$f":"IF(Runden!L14>0,RANK(Runden!L14,Runden!L$4:L$53,0),0)","v":0},{"$f":"IF(Runden!M14>0,RANK(Runden!M14,Runden!M$4:M$53,0),0)","v":0},{"$f":"IF(Runden!N14>0,RANK(Runden!N14,Runden!N$4:N$53,0),0)","v":0},{"$f":"IF(Runden!O14>0,RANK(Runden!O14,Runden!O$4:O$53,0),0)","v":0},{"$f":"IF(Runden!P14>0,RANK(Runden!P14,Runden!P$4:P$53,0),0)","v":0},{"$f":"IF(Runden!Q14>0,RANK(Runden!Q14,Runden!Q$4:Q$53,0),0)","v":0},{"$f":"IF(Runden!R14>0,RANK(Runden!R14,Runden!R$4:R$53,0),0)","v":0},{"$f":"IF(Runden!S14>0,RANK(Runden!S14,Runden!S$4:S$53,0),0)","v":0},{"$f":"IF(Runden!T14>0,RANK(Runden!T14,Runden!T$4:T$53,0),0)","v":0},{"$f":"IF(Runden!U14>0,RANK(Runden!U14,Runden!U$4:U$53,0),0)","v":0},null,0,0,1,0,0,0,0,0,0,0,0,0,0,0,0,0,0,0,0,0,0,0,0,0,48,0,0,9.9999999999999995E-7,0,0,0,0,0,9.9999999999999995E-7,48,4.8000000000000001E-2,0,0,0,0,0,0,0,0,0,0,0,0,0,0,0,0,0,0,0,0,0,0,4.8000000000000001E-2,48]
[{"$f":"IF(Runden!A15=\"\",\"\",Runden!A15)","v":"Christoph"},{"$f":"IF(Runden!B15>0,RANK(Runden!B15,Runden!B$4:B$53,0),0)","v":8},{"$f":"IF(Runden!C15>0,RANK(Runden!C15,Runden!C$4:C$53,0),0)","v":0},{"$f":"IF(Runden!D15>0,RANK(Runden!D15,Runden!D$4:D$53,0),0)","v":0},{"$f":"IF(Runden!E15>0,RANK(Runden!E15,Runden!E$4:E$53,0),0)","v":0},{"$f":"IF(Runden!F15>0,RANK(Runden!F15,Runden!F$4:F$53,0),0)","v":0},{"$f":"IF(Runden!G15>0,RANK(Runden!G15,Runden!G$4:G$53,0),0)","v":0},{"$f":"IF(Runden!H15>0,RANK(Runden!H15,Runden!H$4:H$53,0),0)","v":0},{"$f":"IF(Runden!I15>0,RANK(Runden!I15,Runden!I$4:I$53,0),0)","v":0},{"$f":"IF(Runden!J15>0,RANK(Runden!J15,Runden!J$4:J$53,0),0)","v":0},{"$f":"IF(Runden!K15>0,RANK(Runden!K15,Runden!K$4:K$53,0),0)","v":0},{"$f":"IF(Runden!L15>0,RANK(Runden!L15,Runden!L$4:L$53,0),0)","v":0},{"$f":"IF(Runden!M15>0,RANK(Runden!M15,Runden!M$4:M$53,0),0)","v":0},{"$f":"IF(Runden!N15>0,RANK(Runden!N15,Runden!N$4:N$53,0),0)","v":0},{"$f":"IF(Runden!O15>0,RANK(Runden!O15,Runden!O$4:O$53,0),0)","v":0},{"$f":"IF(Runden!P15>0,RANK(Runden!P15,Runden!P$4:P$53,0),0)","v":0},{"$f":"IF(Runden!Q15>0,RANK(Runden!Q15,Runden!Q$4:Q$53,0),0)","v":0},{"$f":"IF(Runden!R15>0,RANK(Runden!R15,Runden!R$4:R$53,0),0)","v":0},{"$f":"IF(Runden!S15>0,RANK(Runden!S15,Runden!S$4:S$53,0),0)","v":0},{"$f":"IF(Runden!T15>0,RANK(Runden!T15,Runden!T$4:T$53,0),0)","v":0},{"$f":"IF(Runden!U15>0,RANK(Runden!U15,Runden!U$4:U$53,0),0)","v":0},null,0,0,0,0,0,0,0,1,0,0,0,0,0,0,0,0,0,0,0,0,0,0,0,0,43,0,0,0,0,0,0,0,9.9999999999999998E-17,9.9999999999999998E-17,43,4.2999999999999997E-2,0,0,0,0,0,0,0,0,0,0,0,0,0,0,0,0,0,0,0,0,0,0,4.2999999999999997E-2,43]
[{"$f":"IF(Runden!A16=\"\",\"\",Runden!A16)","v":"Olli"},{"$f":"IF(Runden!B16>0,RANK(Runden!B16,Runden!B$4:B$53,0),0)","v":0},{"$f":"IF(Runden!C16>0,RANK(Runden!C16,Runden!C$4:C$53,0),0)","v":0},{"$f":"IF(Runden!D16>0,RANK(Runden!D16,Runden!D$4:D$53,0),0)","v":0},{"$f":"IF(Runden!E16>0,RANK(Runden!E16,Runden!E$4:E$53,0),0)","v":0},{"$f":"IF(Runden!F16>0,RANK(Runden!F16,Runden!F$4:F$53,0),0)","v":0},{"$f":"IF(Runden!G16>0,RANK(Runden!G16,Runden!G$4:G$53,0),0)","v":0},{"$f":"IF(Runden!H16>0,RANK(Runden!H16,Runden!H$4:H$53,0),0)","v":0},{"$f":"IF(Runden!I16>0,RANK(Runden!I16,Runden!I$4:I$53,0),0)","v":0},{"$f":"IF(Runden!J16>0,RANK(Runden!J16,Runden!J$4:J$53,0),0)","v":0},{"$f":"IF(Runden!K16>0,RANK(Runden!K16,Runden!K$4:K$53,0),0)","v":0},{"$f":"IF(Runden!L16>0,RANK(Runden!L16,Runden!L$4:L$53,0),0)","v":0},{"$f":"IF(Runden!M16>0,RANK(Runden!M16,Runden!M$4:M$53,0),0)","v":0},{"$f":"IF(Runden!N16>0,RANK(Runden!N16,Runden!N$4:N$53,0),0)","v":0},{"$f":"IF(Runden!O16>0,RANK(Runden!O16,Runden!O$4:O$53,0),0)","v":0},{"$f":"IF(Runden!P16>0,RANK(Runden!P16,Runden!P$4:P$53,0),0)","v":0},{"$f":"IF(Runden!Q16>0,RANK(Runden!Q16,Runden!Q$4:Q$53,0),0)","v":0},{"$f":"IF(Runden!R16>0,RANK(Runden!R16,Runden!R$4:R$53,0),0)","v":0},{"$f":"IF(Runden!S16>0,RANK(Runden!S16,Runden!S$4:S$53,0),0)","v":0},{"$f":"IF(Runden!T16>0,RANK(Runden!T16,Runden!T$4:T$53,0),0)","v":0},{"$f":"IF(Runden!U16>0,RANK(Runden!U16,Runden!U$4:U$53,0),0)","v":0},null,0,0,0,0,0,0,0,0,0,0,0,0,0,0,0,0,0,0,0,0,0,0,0,0,1,0,0,0,0,0,0,0,0,0,0,0,0,0,0,0,0,0,0,0,0,0,0,0,0,0,0,0,0,0,0,0,0,0,0,1]
[{"$f":"IF(Runden!A17=\"\",\"\",Runden!A17)","v":"Horst"},{"$f":"IF(Runden!B17>0,RANK(Runden!B17,Runden!B$4:B$53,0),0)","v":0},{"$f":"IF(Runden!C17>0,RANK(Runden!C17,Runden!C$4:C$53,0),0)","v":0},{"$f":"IF(Runden!D17>0,RANK(Runden!D17,Runden!D$4:D$53,0),0)","v":0},{"$f":"IF(Runden!E17>0,RANK(Runden!E17,Runden!E$4:E$53,0),0)","v":0},{"$f":"IF(Runden!F17>0,RANK(Runden!F17,Runden!F$4:F$53,0),0)","v":0},{"$f":"IF(Runden!G17>0,RANK(Runden!G17,Runden!G$4:G$53,0),0)","v":0},{"$f":"IF(Runden!H17>0,RANK(Runden!H17,Runden!H$4:H$53,0),0)","v":0},{"$f":"IF(Runden!I17>0,RANK(Runden!I17,Runden!I$4:I$53,0),0)","v":0},{"$f":"IF(Runden!J17>0,RANK(Runden!J17,Runden!J$4:J$53,0),0)","v":0},{"$f":"IF(Runden!K17>0,RANK(Runden!K17,Runden!K$4:K$53,0),0)","v":0},{"$f":"IF(Runden!L17>0,RANK(Runden!L17,Runden!L$4:L$53,0),0)","v":0},{"$f":"IF(Runden!M17>0,RANK(Runden!M17,Runden!M$4:M$53,0),0)","v":0},{"$f":"IF(Runden!N17>0,RANK(Runden!N17,Runden!N$4:N$53,0),0)","v":0},{"$f":"IF(Runden!O17>0,RANK(Runden!O17,Runden!O$4:O$53,0),0)","v":0},{"$f":"IF(Runden!P17>0,RANK(Runden!P17,Runden!P$4:P$53,0),0)","v":0},{"$f":"IF(Runden!Q17>0,RANK(Runden!Q17,Runden!Q$4:Q$53,0),0)","v":0},{"$f":"IF(Runden!R17>0,RANK(Runden!R17,Runden!R$4:R$53,0),0)","v":0},{"$f":"IF(Runden!S17>0,RANK(Runden!S17,Runden!S$4:S$53,0),0)","v":0},{"$f":"IF(Runden!T17>0,RANK(Runden!T17,Runden!T$4:T$53,0),0)","v":0},{"$f":"IF(Runden!U17>0,RANK(Runden!U17,Runden!U$4:U$53,0),0)","v":0},null,0,0,0,0,0,0,0,0,0,0,0,0,0,0,0,0,0,0,0,0,0,0,0,0,1,0,0,0,0,0,0,0,0,0,0,0,0,0,0,0,0,0,0,0,0,0,0,0,0,0,0,0,0,0,0,0,0,0,0,1]
[{"$f":"IF(Runden!A18=\"\",\"\",Runden!A18)","v":""},{"$f":"IF(Runden!B18>0,RANK(Runden!B18,Runden!B$4:B$53,0),0)","v":0},{"$f":"IF(Runden!C18>0,RANK(Runden!C18,Runden!C$4:C$53,0),0)","v":0},{"$f":"IF(Runden!D18>0,RANK(Runden!D18,Runden!D$4:D$53,0),0)","v":0},{"$f":"IF(Runden!E18>0,RANK(Runden!E18,Runden!E$4:E$53,0),0)","v":0},{"$f":"IF(Runden!F18>0,RANK(Runden!F18,Runden!F$4:F$53,0),0)","v":0},{"$f":"IF(Runden!G18>0,RANK(Runden!G18,Runden!G$4:G$53,0),0)","v":0},{"$f":"IF(Runden!H18>0,RANK(Runden!H18,Runden!H$4:H$53,0),0)","v":0},{"$f":"IF(Runden!I18>0,RANK(Runden!I18,Runden!I$4:I$53,0),0)","v":0},{"$f":"IF(Runden!J18>0,RANK(Runden!J18,Runden!J$4:J$53,0),0)","v":0},{"$f":"IF(Runden!K18>0,RANK(Runden!K18,Runden!K$4:K$53,0),0)","v":0},{"$f":"IF(Runden!L18>0,RANK(Runden!L18,Runden!L$4:L$53,0),0)","v":0},{"$f":"IF(Runden!M18>0,RANK(Runden!M18,Runden!M$4:M$53,0),0)","v":0},{"$f":"IF(Runden!N18>0,RANK(Runden!N18,Runden!N$4:N$53,0),0)","v":0},{"$f":"IF(Runden!O18>0,RANK(Runden!O18,Runden!O$4:O$53,0),0)","v":0},{"$f":"IF(Runden!P18>0,RANK(Runden!P18,Runden!P$4:P$53,0),0)","v":0},{"$f":"IF(Runden!Q18>0,RANK(Runden!Q18,Runden!Q$4:Q$53,0),0)","v":0},{"$f":"IF(Runden!R18>0,RANK(Runden!R18,Runden!R$4:R$53,0),0)","v":0},{"$f":"IF(Runden!S18>0,RANK(Runden!S18,Runden!S$4:S$53,0),0)","v":0},{"$f":"IF(Runden!T18>0,RANK(Runden!T18,Runden!T$4:T$53,0),0)","v":0},{"$f":"IF(Runden!U18>0,RANK(Runden!U18,Runden!U$4:U$53,0),0)","v":0},null,0,0,0,0,0,0,0,0,0,0,0,0,0,0,0,0,0,0,0,0,0,0,0,0,1,0,0,0,0,0,0,0,0,0,0,0,0,0,0,0,0,0,0,0,0,0,0,0,0,0,0,0,0,0,0,0,0,0,0,1]
[{"$f":"IF(Runden!A19=\"\",\"\",Runden!A19)","v":""},{"$f":"IF(Runden!B19>0,RANK(Runden!B19,Runden!B$4:B$53,0),0)","v":0},{"$f":"IF(Runden!C19>0,RANK(Runden!C19,Runden!C$4:C$53,0),0)","v":0},{"$f":"IF(Runden!D19>0,RANK(Runden!D19,Runden!D$4:D$53,0),0)","v":0},{"$f":"IF(Runden!E19>0,RANK(Runden!E19,Runden!E$4:E$53,0),0)","v":0},{"$f":"IF(Runden!F19>0,RANK(Runden!F19,Runden!F$4:F$53,0),0)","v":0},{"$f":"IF(Runden!G19>0,RANK(Runden!G19,Runden!G$4:G$53,0),0)","v":0},{"$f":"IF(Runden!H19>0,RANK(Runden!H19,Runden!H$4:H$53,0),0)","v":0},{"$f":"IF(Runden!I19>0,RANK(Runden!I19,Runden!I$4:I$53,0),0)","v":0},{"$f":"IF(Runden!J19>0,RANK(Runden!J19,Runden!J$4:J$53,0),0)","v":0},{"$f":"IF(Runden!K19>0,RANK(Runden!K19,Runden!K$4:K$53,0),0)","v":0},{"$f":"IF(Runden!L19>0,RANK(Runden!L19,Runden!L$4:L$53,0),0)","v":0},{"$f":"IF(Runden!M19>0,RANK(Runden!M19,Runden!M$4:M$53,0),0)","v":0},{"$f":"IF(Runden!N19>0,RANK(Runden!N19,Runden!N$4:N$53,0),0)","v":0},{"$f":"IF(Runden!O19>0,RANK(Runden!O19,Runden!O$4:O$53,0),0)","v":0},{"$f":"IF(Runden!P19>0,RANK(Runden!P19,Runden!P$4:P$53,0),0)","v":0},{"$f":"IF(Runden!Q19>0,RANK(Runden!Q19,Runden!Q$4:Q$53,0),0)","v":0},{"$f":"IF(Runden!R19>0,RANK(Runden!R19,Runden!R$4:R$53,0),0)","v":0},{"$f":"IF(Runden!S19>0,RANK(Runden!S19,Runden!S$4:S$53,0),0)","v":0},{"$f":"IF(Runden!T19>0,RANK(Runden!T19,Runden!T$4:T$53,0),0)","v":0},{"$f":"IF(Runden!U19>0,RANK(Runden!U19,Runden!U$4:U$53,0),0)","v":0},null,0,0,0,0,0,0,0,0,0,0,0,0,0,0,0,0,0,0,0,0,0,0,0,0,1,0,0,0,0,0,0,0,0,0,0,0,0,0,0,0,0,0,0,0,0,0,0,0,0,0,0,0,0,0,0,0,0,0,0,1]
[{"$f":"IF(Runden!A20=\"\",\"\",Runden!A20)","v":""},{"$f":"IF(Runden!B20>0,RANK(Runden!B20,Runden!B$4:B$53,0),0)","v":0},{"$f":"IF(Runden!C20>0,RANK(Runden!C20,Runden!C$4:C$53,0),0)","v":0},{"$f":"IF(Runden!D20>0,RANK(Runden!D20,Runden!D$4:D$53,0),0)","v":0},{"$f":"IF(Runden!E20>0,RANK(Runden!E20,Runden!E$4:E$53,0),0)","v":0},{"$f":"IF(Runden!F20>0,RANK(Runden!F20,Runden!F$4:F$53,0),0)","v":0},{"$f":"IF(Runden!G20>0,RANK(Runden!G20,Runden!G$4:G$53,0),0)","v":0},{"$f":"IF(Runden!H20>0,RANK(Runden!H20,Runden!H$4:H$53,0),0)","v":0},{"$f":"IF(Runden!I20>0,RANK(Runden!I20,Runden!I$4:I$53,0),0)","v":0},{"$f":"IF(Runden!J20>0,RANK(Runden!J20,Runden!J$4:J$53,0),0)","v":0},{"$f":"IF(Runden!K20>0,RANK(Runden!K20,Runden!K$4:K$53,0),0)","v":0},{"$f":"IF(Runden!L20>0,RANK(Runden!L20,Runden!L$4:L$53,0),0)","v":0},{"$f":"IF(Runden!M20>0,RANK(Runden!M20,Runden!M$4:M$53,0),0)","v":0},{"$f":"IF(Runden!N20>0,RANK(Runden!N20,Runden!N$4:N$53,0),0)","v":0},{"$f":"IF(Runden!O20>0,RANK(Runden!O20,Runden!O$4:O$53,0),0)","v":0},{"$f":"IF(Runden!P20>0,RANK(Runden!P20,Runden!P$4:P$53,0),0)","v":0},{"$f":"IF(Runden!Q20>0,RANK(Runden!Q20,Runden!Q$4:Q$53,0),0)","v":0},{"$f":"IF(Runden!R20>0,RANK(Runden!R20,Runden!R$4:R$53,0),0)","v":0},{"$f":"IF(Runden!S20>0,RANK(Runden!S20,Runden!S$4:S$53,0),0)","v":0},{"$f":"IF(Runden!T20>0,RANK(Runden!T20,Runden!T$4:T$53,0),0)","v":0},{"$f":"IF(Runden!U20>0,RANK(Runden!U20,Runden!U$4:U$53,0),0)","v":0},null,0,0,0,0,0,0,0,0,0,0,0,0,0,0,0,0,0,0,0,0,{"$f":"COUNTIF($B20:$U20,AQ$3)","v":0},0,0,0,1,0,0,0,0,0,0,0,0,0,0,0,0,0,0,0,0,0,0,0,0,0,0,0,0,0,0,0,0,0,0,0,0,0,0,1]
[{"$f":"IF(Runden!A21=\"\",\"\",Runden!A21)","v":""},{"$f":"IF(Runden!B21>0,RANK(Runden!B21,Runden!B$4:B$53,0),0)","v":0},{"$f":"IF(Runden!C21>0,RANK(Runden!C21,Runden!C$4:C$53,0),0)","v":0},{"$f":"IF(Runden!D21>0,RANK(Runden!D21,Runden!D$4:D$53,0),0)","v":0},{"$f":"IF(Runden!E21>0,RANK(Runden!E21,Runden!E$4:E$53,0),0)","v":0},{"$f":"IF(Runden!F21>0,RANK(Runden!F21,Runden!F$4:F$53,0),0)","v":0},{"$f":"IF(Runden!G21>0,RANK(Runden!G21,Runden!G$4:G$53,0),0)","v":0},{"$f":"IF(Runden!H21>0,RANK(Runden!H21,Runden!H$4:H$53,0),0)","v":0},{"$f":"IF(Runden!I21>0,RANK(Runden!I21,Runden!I$4:I$53,0),0)","v":0},{"$f":"IF(Runden!J21>0,RANK(Runden!J21,Runden!J$4:J$53,0),0)","v":0},{"$f":"IF(Runden!K21>0,RANK(Runden!K21,Runden!K$4:K$53,0),0)","v":0},{"$f":"IF(Runden!L21>0,RANK(Runden!L21,Runden!L$4:L$53,0),0)","v":0},{"$f":"IF(Runden!M21>0,RANK(Runden!M21,Runden!M$4:M$53,0),0)","v":0},{"$f":"IF(Runden!N21>0,RANK(Runden!N21,Runden!N$4:N$53,0),0)","v":0},{"$f":"IF(Runden!O21>0,RANK(Runden!O21,Runden!O$4:O$53,0),0)","v":0},{"$f":"IF(Runden!P21>0,RANK(Runden!P21,Runden!P$4:P$53,0),0)","v":0},{"$f":"IF(Runden!Q21>0,RANK(Runden!Q21,Runden!Q$4:Q$53,0),0)","v":0},{"$f":"IF(Runden!R21>0,RANK(Runden!R21,Runden!R$4:R$53,0),0)","v":0},{"$f":"IF(Runden!S21>0,RANK(Runden!S21,Runden!S$4:S$53,0),0)","v":0},{"$f":"IF(Runden!T21>0,RANK(Runden!T21,Runden!T$4:T$53,0),0)","v":0},{"$f":"IF(Runden!U21>0,RANK(Runden!U21,Runden!U$4:U$53,0),0)","v":0},null,0,0,0,0,0,0,0,0,0,0,0,0,0,0,0,0,0,0,0,0,0,0,0,0,1,0,0,0,0,0,0,0,0,0,0,0,0,0,0,0,0,0,0,0,0,0,0,0,0,0,0,0,0,0,0,0,0,0,0,1]
[{"$f":"IF(Runden!A22=\"\",\"\",Runden!A22)","v":""},{"$f":"IF(Runden!B22>0,RANK(Runden!B22,Runden!B$4:B$53,0),0)","v":0},{"$f":"IF(Runden!C22>0,RANK(Runden!C22,Runden!C$4:C$53,0),0)","v":0},{"$f":"IF(Runden!D22>0,RANK(Runden!D22,Runden!D$4:D$53,0),0)","v":0},{"$f":"IF(Runden!E22>0,RANK(Runden!E22,Runden!E$4:E$53,0),0)","v":0},{"$f":"IF(Runden!F22>0,RANK(Runden!F22,Runden!F$4:F$53,0),0)","v":0},{"$f":"IF(Runden!G22>0,RANK(Runden!G22,Runden!G$4:G$53,0),0)","v":0},{"$f":"IF(Runden!H22>0,RANK(Runden!H22,Runden!H$4:H$53,0),0)","v":0},{"$f":"IF(Runden!I22>0,RANK(Runden!I22,Runden!I$4:I$53,0),0)","v":0},{"$f":"IF(Runden!J22>0,RANK(Runden!J22,Runden!J$4:J$53,0),0)","v":0},{"$f":"IF(Runden!K22>0,RANK(Runden!K22,Runden!K$4:K$53,0),0)","v":0},{"$f":"IF(Runden!L22>0,RANK(Runden!L22,Runden!L$4:L$53,0),0)","v":0},{"$f":"IF(Runden!M22>0,RANK(Runden!M22,Runden!M$4:M$53,0),0)","v":0},{"$f":"IF(Runden!N22>0,RANK(Runden!N22,Runden!N$4:N$53,0),0)","v":0},{"$f":"IF(Runden!O22>0,RANK(Runden!O22,Runden!O$4:O$53,0),0)","v":0},{"$f":"IF(Runden!P22>0,RANK(Runden!P22,Runden!P$4:P$53,0),0)","v":0},{"$f":"IF(Runden!Q22>0,RANK(Runden!Q22,Runden!Q$4:Q$53,0),0)","v":0},{"$f":"IF(Runden!R22>0,RANK(Runden!R22,Runden!R$4:R$53,0),0)","v":0},{"$f":"IF(Runden!S22>0,RANK(Runden!S22,Runden!S$4:S$53,0),0)","v":0},{"$f":"IF(Runden!T22>0,RANK(Runden!T22,Runden!T$4:T$53,0),0)","v":0},{"$f":"IF(Runden!U22>0,RANK(Runden!U22,Runden!U$4:U$53,0),0)","v":0},null,0,0,0,0,0,0,0,0,0,0,0,0,0,0,0,0,0,0,0,0,0,0,0,0,1,0,0,0,0,0,0,0,0,0,0,0,0,0,0,0,0,0,0,0,0,0,0,0,0,0,0,0,0,0,0,0,0,0,0,1]
[{"$f":"IF(Runden!A23=\"\",\"\",Runden!A23)","v":""},{"$f":"IF(Runden!B23>0,RANK(Runden!B23,Runden!B$4:B$53,0),0)","v":0},{"$f":"IF(Runden!C23>0,RANK(Runden!C23,Runden!C$4:C$53,0),0)","v":0},{"$f":"IF(Runden!D23>0,RANK(Runden!D23,Runden!D$4:D$53,0),0)","v":0},{"$f":"IF(Runden!E23>0,RANK(Runden!E23,Runden!E$4:E$53,0),0)","v":0},{"$f":"IF(Runden!F23>0,RANK(Runden!F23,Runden!F$4:F$53,0),0)","v":0},{"$f":"IF(Runden!G23>0,RANK(Runden!G23,Runden!G$4:G$53,0),0)","v":0},{"$f":"IF(Runden!H23>0,RANK(Runden!H23,Runden!H$4:H$53,0),0)","v":0},{"$f":"IF(Runden!I23>0,RANK(Runden!I23,Runden!I$4:I$53,0),0)","v":0},{"$f":"IF(Runden!J23>0,RANK(Runden!J23,Runden!J$4:J$53,0),0)","v":0},{"$f":"IF(Runden!K23>0,RANK(Runden!K23,Runden!K$4:K$53,0),0)","v":0},{"$f":"IF(Runden!L23>0,RANK(Runden!L23,Runden!L$4:L$53,0),0)","v":0},{"$f":"IF(Runden!M23>0,RANK(Runden!M23,Runden!M$4:M$53,0),0)","v":0},{"$f":"IF(Runden!N23>0,RANK(Runden!N23,Runden!N$4:N$53,0),0)","v":0},{"$f":"IF(Runden!O23>0,RANK(Runden!O23,Runden!O$4:O$53,0),0)","v":0},{"$f":"IF(Runden!P23>0,RANK(Runden!P23,Runden!P$4:P$53,0),0)","v":0},{"$f":"IF(Runden!Q23>0,RANK(Runden!Q23,Runden!Q$4:Q$53,0),0)","v":0},{"$f":"IF(Runden!R23>0,RANK(Runden!R23,Runden!R$4:R$53,0),0)","v":0},{"$f":"IF(Runden!S23>0,RANK(Runden!S23,Runden!S$4:S$53,0),0)","v":0},{"$f":"IF(Runden!T23>0,RANK(Runden!T23,Runden!T$4:T$53,0),0)","v":0},{"$f":"IF(Runden!U23>0,RANK(Runden!U23,Runden!U$4:U$53,0),0)","v":0},null,0,0,0,0,0,0,0,0,0,0,0,0,0,0,0,0,0,0,0,0,0,0,0,0,1,0,0,0,0,0,0,0,0,0,0,0,0,0,0,0,0,0,0,0,0,0,0,0,0,0,0,0,0,0,0,0,0,0,0,1]
[{"$f":"IF(Runden!A24=\"\",\"\",Runden!A24)","v":""},{"$f":"IF(Runden!B24>0,RANK(Runden!B24,Runden!B$4:B$53,0),0)","v":0},{"$f":"IF(Runden!C24>0,RANK(Runden!C24,Runden!C$4:C$53,0),0)","v":0},{"$f":"IF(Runden!D24>0,RANK(Runden!D24,Runden!D$4:D$53,0),0)","v":0},{"$f":"IF(Runden!E24>0,RANK(Runden!E24,Runden!E$4:E$53,0),0)","v":0},{"$f":"IF(Runden!F24>0,RANK(Runden!F24,Runden!F$4:F$53,0),0)","v":0},{"$f":"IF(Runden!G24>0,RANK(Runden!G24,Runden!G$4:G$53,0),0)","v":0},{"$f":"IF(Runden!H24>0,RANK(Runden!H24,Runden!H$4:H$53,0),0)","v":0},{"$f":"IF(Runden!I24>0,RANK(Runden!I24,Runden!I$4:I$53,0),0)","v":0},{"$f":"IF(Runden!J24>0,RANK(Runden!J24,Runden!J$4:J$53,0),0)","v":0},{"$f":"IF(Runden!K24>0,RANK(Runden!K24,Runden!K$4:K$53,0),0)","v":0},{"$f":"IF(Runden!L24>0,RANK(Runden!L24,Runden!L$4:L$53,0),0)","v":0},{"$f":"IF(Runden!M24>0,RANK(Runden!M24,Runden!M$4:M$53,0),0)","v":0},{"$f":"IF(Runden!N24>0,RANK(Runden!N24,Runden!N$4:N$53,0),0)","v":0},{"$f":"IF(Runden!O24>0,RANK(Runden!O24,Runden!O$4:O$53,0),0)","v":0},{"$f":"IF(Runden!P24>0,RANK(Runden!P24,Runden!P$4:P$53,0),0)","v":0},{"$f":"IF(Runden!Q24>0,RANK(Runden!Q24,Runden!Q$4:Q$53,0),0)","v":0},{"$f":"IF(Runden!R24>0,RANK(Runden!R24,Runden!R$4:R$53,0),0)","v":0},{"$f":"IF(Runden!S24>0,RANK(Runden!S24,Runden!S$4:S$53,0),0)","v":0},{"$f":"IF(Runden!T24>0,RANK(Runden!T24,Runden!T$4:T$53,0),0)","v":0},{"$f":"IF(Runden!U24>0,RANK(Runden!U24,Runden!U$4:U$53,0),0)","v":0},null,0,0,0,0,0,0,0,0,0,0,0,0,0,0,0,0,0,0,0,0,0,0,0,0,1,0,0,0,0,0,0,0,0,0,0,0,0,0,0,0,0,0,0,0,0,0,0,0,0,0,0,0,0,0,0,0,0,0,0,1]
[{"$f":"IF(Runden!A25=\"\",\"\",Runden!A25)","v":""},{"$f":"IF(Runden!B25>0,RANK(Runden!B25,Runden!B$4:B$53,0),0)","v":0},{"$f":"IF(Runden!C25>0,RANK(Runden!C25,Runden!C$4:C$53,0),0)","v":0},{"$f":"IF(Runden!D25>0,RANK(Runden!D25,Runden!D$4:D$53,0),0)","v":0},{"$f":"IF(Runden!E25>0,RANK(Runden!E25,Runden!E$4:E$53,0),0)","v":0},{"$f":"IF(Runden!F25>0,RANK(Runden!F25,Runden!F$4:F$53,0),0)","v":0},{"$f":"IF(Runden!G25>0,RANK(Runden!G25,Runden!G$4:G$53,0),0)","v":0},{"$f":"IF(Runden!H25>0,RANK(Runden!H25,Runden!H$4:H$53,0),0)","v":0},{"$f":"IF(Runden!I25>0,RANK(Runden!I25,Runden!I$4:I$53,0),0)","v":0},{"$f":"IF(Runden!J25>0,RANK(Runden!J25,Runden!J$4:J$53,0),0)","v":0},{"$f":"IF(Runden!K25>0,RANK(Runden!K25,Runden!K$4:K$53,0),0)","v":0},{"$f":"IF(Runden!L25>0,RANK(Runden!L25,Runden!L$4:L$53,0),0)","v":0},{"$f":"IF(Runden!M25>0,RANK(Runden!M25,Runden!M$4:M$53,0),0)","v":0},{"$f":"IF(Runden!N25>0,RANK(Runden!N25,Runden!N$4:N$53,0),0)","v":0},{"$f":"IF(Runden!O25>0,RANK(Runden!O25,Runden!O$4:O$53,0),0)","v":0},{"$f":"IF(Runden!P25>0,RANK(Runden!P25,Runden!P$4:P$53,0),0)","v":0},{"$f":"IF(Runden!Q25>0,RANK(Runden!Q25,Runden!Q$4:Q$53,0),0)","v":0},{"$f":"IF(Runden!R25>0,RANK(Runden!R25,Runden!R$4:R$53,0),0)","v":0},{"$f":"IF(Runden!S25>0,RANK(Runden!S25,Runden!S$4:S$53,0),0)","v":0},{"$f":"IF(Runden!T25>0,RANK(Runden!T25,Runden!T$4:T$53,0),0)","v":0},{"$f":"IF(Runden!U25>0,RANK(Runden!U25,Runden!U$4:U$53,0),0)","v":0},null,0,0,0,0,0,0,0,0,0,0,{"$f":"COUNTIF($B25:$U25,AG$3)","v":0},0,0,0,0,0,0,0,0,0,0,0,0,0,1,0,0,0,0,0,0,0,0,0,0,0,0,0,0,0,0,0,0,0,0,0,0,0,0,0,0,0,0,0,0,0,0,0,0,1]
[{"$f":"IF(Runden!A26=\"\",\"\",Runden!A26)","v":""},{"$f":"IF(Runden!B26>0,RANK(Runden!B26,Runden!B$4:B$53,0),0)","v":0},{"$f":"IF(Runden!C26>0,RANK(Runden!C26,Runden!C$4:C$53,0),0)","v":0},{"$f":"IF(Runden!D26>0,RANK(Runden!D26,Runden!D$4:D$53,0),0)","v":0},{"$f":"IF(Runden!E26>0,RANK(Runden!E26,Runden!E$4:E$53,0),0)","v":0},{"$f":"IF(Runden!F26>0,RANK(Runden!F26,Runden!F$4:F$53,0),0)","v":0},{"$f":"IF(Runden!G26>0,RANK(Runden!G26,Runden!G$4:G$53,0),0)","v":0},{"$f":"IF(Runden!H26>0,RANK(Runden!H26,Runden!H$4:H$53,0),0)","v":0},{"$f":"IF(Runden!I26>0,RANK(Runden!I26,Runden!I$4:I$53,0),0)","v":0},{"$f":"IF(Runden!J26>0,RANK(Runden!J26,Runden!J$4:J$53,0),0)","v":0},{"$f":"IF(Runden!K26>0,RANK(Runden!K26,Runden!K$4:K$53,0),0)","v":0},{"$f":"IF(Runden!L26>0,RANK(Runden!L26,Runden!L$4:L$53,0),0)","v":0},{"$f":"IF(Runden!M26>0,RANK(Runden!M26,Runden!M$4:M$53,0),0)","v":0},{"$f":"IF(Runden!N26>0,RANK(Runden!N26,Runden!N$4:N$53,0),0)","v":0},{"$f":"IF(Runden!O26>0,RANK(Runden!O26,Runden!O$4:O$53,0),0)","v":0},{"$f":"IF(Runden!P26>0,RANK(Runden!P26,Runden!P$4:P$53,0),0)","v":0},{"$f":"IF(Runden!Q26>0,RANK(Runden!Q26,Runden!Q$4:Q$53,0),0)","v":0},{"$f":"IF(Runden!R26>0,RANK(Runden!R26,Runden!R$4:R$53,0),0)","v":0},{"$f":"IF(Runden!S26>0,RANK(Runden!S26,Runden!S$4:S$53,0),0)","v":0},{"$f":"IF(Runden!T26>0,RANK(Runden!T26,Runden!T$4:T$53,0),0)","v":0},{"$f":"IF(Runden!U26>0,RANK(Runden!U26,Runden!U$4:U$53,0),0)","v":0},null,{"$f":"COUNTIF($B26:$U26,W$3)","v":0},0,0,0,0,0,0,0,0,0,0,0,0,0,0,0,0,0,0,0,0,0,0,0,1,0,0,0,0,0,0,0,0,0,0,0,0,0,0,0,0,0,0,0,0,0,0,0,0,0,0,0,0,0,0,0,0,0,0,1]
[{"$f":"IF(Runden!A27=\"\",\"\",Runden!A27)","v":""},{"$f":"IF(Runden!B27>0,RANK(Runden!B27,Runden!B$4:B$53,0),0)","v":0},{"$f":"IF(Runden!C27>0,RANK(Runden!C27,Runden!C$4:C$53,0),0)","v":0},{"$f":"IF(Runden!D27>0,RANK(Runden!D27,Runden!D$4:D$53,0),0)","v":0},{"$f":"IF(Runden!E27>0,RANK(Runden!E27,Runden!E$4:E$53,0),0)","v":0},{"$f":"IF(Runden!F27>0,RANK(Runden!F27,Runden!F$4:F$53,0),0)","v":0},{"$f":"IF(Runden!G27>0,RANK(Runden!G27,Runden!G$4:G$53,0),0)","v":0},{"$f":"IF(Runden!H27>0,RANK(Runden!H27,Runden!H$4:H$53,0),0)","v":0},{"$f":"IF(Runden!I27>0,RANK(Runden!I27,Runden!I$4:I$53,0),0)","v":0},{"$f":"IF(Runden!J27>0,RANK(Runden!J27,Runden!J$4:J$53,0),0)","v":0},{"$f":"IF(Runden!K27>0,RANK(Runden!K27,Runden!K$4:K$53,0),0)","v":0},{"$f":"IF(Runden!L27>0,RANK(Runden!L27,Runden!L$4:L$53,0),0)","v":0},{"$f":"IF(Runden!M27>0,RANK(Runden!M27,Runden!M$4:M$53,0),0)","v":0},{"$f":"IF(Runden!N27>0,RANK(Runden!N27,Runden!N$4:N$53,0),0)","v":0},{"$f":"IF(Runden!O27>0,RANK(Runden!O27,Runden!O$4:O$53,0),0)","v":0},{"$f":"IF(Runden!P27>0,RANK(Runden!P27,Runden!P$4:P$53,0),0)","v":0},{"$f":"IF(Runden!Q27>0,RANK(Runden!Q27,Runden!Q$4:Q$53,0),0)","v":0},{"$f":"IF(Runden!R27>0,RANK(Runden!R27,Runden!R$4:R$53,0),0)","v":0},{"$f":"IF(Runden!S27>0,RANK(Runden!S27,Runden!S$4:S$53,0),0)","v":0},{"$f":"IF(Runden!T27>0,RANK(Runden!T27,Runden!T$4:T$53,0),0)","v":0},{"$f":"IF(Runden!U27>0,RANK(Runden!U27,Runden!U$4:U$53,0),0)","v":0},null,0,0,0,0,0,0,0,0,0,0,0,0,0,0,0,0,0,0,0,0,0,0,0,0,1,0,0,0,0,0,0,0,0,0,0,0,0,0,0,0,0,0,0,0,0,0,0,0,0,0,0,0,0,0,0,0,0,0,0,1]
[{"$f":"IF(Runden!A28=\"\",\"\",Runden!A28)","v":""},{"$f":"IF(Runden!B28>0,RANK(Runden!B28,Runden!B$4:B$53,0),0)","v":0},{"$f":"IF(Runden!C28>0,RANK(Runden!C28,Runden!C$4:C$53,0),0)","v":0},{"$f":"IF(Runden!D28>0,RANK(Runden!D28,Runden!D$4:D$53,0),0)","v":0},{"$f":"IF(Runden!E28>0,RANK(Runden!E28,Runden!E$4:E$53,0),0)","v":0},{"$f":"IF(Runden!F28>0,RANK(Runden!F28,Runden!F$4:F$53,0),0)","v":0},{"$f":"IF(Runden!G28>0,RANK(Runden!G28,Runden!G$4:G$53,0),0)","v":0},{"$f":"IF(Runden!H28>0,RANK(Runden!H28,Runden!H$4:H$53,0),0)","v":0},{"$f":"IF(Runden!I28>0,RANK(Runden!I28,Runden!I$4:I$53,0),0)","v":0},{"$f":"IF(Runden!J28>0,RANK(Runden!J28,Runden!J$4:J$53,0),0)","v":0},{"$f":"IF(Runden!K28>0,RANK(Runden!K28,Runden!K$4:K$53,0),0)","v":0},{"$f":"IF(Runden!L28>0,RANK(Runden!L28,Runden!L$4:L$53,0),0)","v":0},{"$f":"IF(Runden!M28>0,RANK(Runden!M28,Runden!M$4:M$53,0),0)","v":0},{"$f":"IF(Runden!N28>0,RANK(Runden!N28,Runden!N$4:N$53,0),0)","v":0},{"$f":"IF(Runden!O28>0,RANK(Runden!O28,Runden!O$4:O$53,0),0)","v":0},{"$f":"IF(Runden!P28>0,RANK(Runden!P28,Runden!P$4:P$53,0),0)","v":0},{"$f":"IF(Runden!Q28>0,RANK(Runden!Q28,Runden!Q$4:Q$53,0),0)","v":0},{"$f":"IF(Runden!R28>0,RANK(Runden!R28,Runden!R$4:R$53,0),0)","v":0},{"$f":"IF(Runden!S28>0,RANK(Runden!S28,Runden!S$4:S$53,0),0)","v":0},{"$f":"IF(Runden!T28>0,RANK(Runden!T28,Runden!T$4:T$53,0),0)","v":0},{"$f":"IF(Runden!U28>0,RANK(Runden!U28,Runden!U$4:U$53,0),0)","v":0},null,0,0,0,0,0,0,0,0,0,0,0,0,0,0,0,0,0,0,0,0,0,0,0,0,1,0,0,0,0,0,0,0,0,0,0,0,0,0,0,0,0,0,0,0,0,0,0,0,0,0,0,0,0,0,0,0,0,0,0,1]
[{"$f":"IF(Runden!A29=\"\",\"\",Runden!A29)","v":""},{"$f":"IF(Runden!B29>0,RANK(Runden!B29,Runden!B$4:B$53,0),0)","v":0},{"$f":"IF(Runden!C29>0,RANK(Runden!C29,Runden!C$4:C$53,0),0)","v":0},{"$f":"IF(Runden!D29>0,RANK(Runden!D29,Runden!D$4:D$53,0),0)","v":0},{"$f":"IF(Runden!E29>0,RANK(Runden!E29,Runden!E$4:E$53,0),0)","v":0},{"$f":"IF(Runden!F29>0,RANK(Runden!F29,Runden!F$4:F$53,0),0)","v":0},{"$f":"IF(Runden!G29>0,RANK(Runden!G29,Runden!G$4:G$53,0),0)","v":0},{"$f":"IF(Runden!H29>0,RANK(Runden!H29,Runden!H$4:H$53,0),0)","v":0},{"$f":"IF(Runden!I29>0,RANK(Runden!I29,Runden!I$4:I$53,0),0)","v":0},{"$f":"IF(Runden!J29>0,RANK(Runden!J29,Runden!J$4:J$53,0),0)","v":0},{"$f":"IF(Runden!K29>0,RANK(Runden!K29,Runden!K$4:K$53,0),0)","v":0},{"$f":"IF(Runden!L29>0,RANK(Runden!L29,Runden!L$4:L$53,0),0)","v":0},{"$f":"IF(Runden!M29>0,RANK(Runden!M29,Runden!M$4:M$53,0),0)","v":0},{"$f":"IF(Runden!N29>0,RANK(Runden!N29,Runden!N$4:N$53,0),0)","v":0},{"$f":"IF(Runden!O29>0,RANK(Runden!O29,Runden!O$4:O$53,0),0)","v":0},{"$f":"IF(Runden!P29>0,RANK(Runden!P29,Runden!P$4:P$53,0),0)","v":0},{"$f":"IF(Runden!Q29>0,RANK(Runden!Q29,Runden!Q$4:Q$53,0),0)","v":0},{"$f":"IF(Runden!R29>0,RANK(Runden!R29,Runden!R$4:R$53,0),0)","v":0},{"$f":"IF(Runden!S29>0,RANK(Runden!S29,Runden!S$4:S$53,0),0)","v":0},{"$f":"IF(Runden!T29>0,RANK(Runden!T29,Runden!T$4:T$53,0),0)","v":0},{"$f":"IF(Runden!U29>0,RANK(Runden!U29,Runden!U$4:U$53,0),0)","v":0},null,0,0,0,0,0,0,0,0,0,0,0,0,0,0,0,0,0,0,0,0,0,0,0,0,1,0,0,0,0,0,0,0,0,0,0,0,0,0,0,0,0,0,0,0,0,0,0,0,0,0,0,0,0,0,0,0,0,0,0,1]
[{"$f":"IF(Runden!A30=\"\",\"\",Runden!A30)","v":""},{"$f":"IF(Runden!B30>0,RANK(Runden!B30,Runden!B$4:B$53,0),0)","v":0},{"$f":"IF(Runden!C30>0,RANK(Runden!C30,Runden!C$4:C$53,0),0)","v":0},{"$f":"IF(Runden!D30>0,RANK(Runden!D30,Runden!D$4:D$53,0),0)","v":0},{"$f":"IF(Runden!E30>0,RANK(Runden!E30,Runden!E$4:E$53,0),0)","v":0},{"$f":"IF(Runden!F30>0,RANK(Runden!F30,Runden!F$4:F$53,0),0)","v":0},{"$f":"IF(Runden!G30>0,RANK(Runden!G30,Runden!G$4:G$53,0),0)","v":0},{"$f":"IF(Runden!H30>0,RANK(Runden!H30,Runden!H$4:H$53,0),0)","v":0},{"$f":"IF(Runden!I30>0,RANK(Runden!I30,Runden!I$4:I$53,0),0)","v":0},{"$f":"IF(Runden!J30>0,RANK(Runden!J30,Runden!J$4:J$53,0),0)","v":0},{"$f":"IF(Runden!K30>0,RANK(Runden!K30,Runden!K$4:K$53,0),0)","v":0},{"$f":"IF(Runden!L30>0,RANK(Runden!L30,Runden!L$4:L$53,0),0)","v":0},{"$f":"IF(Runden!M30>0,RANK(Runden!M30,Runden!M$4:M$53,0),0)","v":0},{"$f":"IF(Runden!N30>0,RANK(Runden!N30,Runden!N$4:N$53,0),0)","v":0},{"$f":"IF(Runden!O30>0,RANK(Runden!O30,Runden!O$4:O$53,0),0)","v":0},{"$f":"IF(Runden!P30>0,RANK(Runden!P30,Runden!P$4:P$53,0),0)","v":0},{"$f":"IF(Runden!Q30>0,RANK(Runden!Q30,Runden!Q$4:Q$53,0),0)","v":0},{"$f":"IF(Runden!R30>0,RANK(Runden!R30,Runden!R$4:R$53,0),0)","v":0},{"$f":"IF(Runden!S30>0,RANK(Runden!S30,Runden!S$4:S$53,0),0)","v":0},{"$f":"IF(Runden!T30>0,RANK(Runden!T30,Runden!T$4:T$53,0),0)","v":0},{"$f":"IF(Runden!U30>0,RANK(Runden!U30,Runden!U$4:U$53,0),0)","v":0},null,0,0,0,0,0,0,0,0,0,0,0,0,0,0,0,0,0,0,0,0,0,0,0,0,1,0,0,0,0,0,0,0,0,0,0,0,0,0,0,0,0,0,0,0,0,0,0,0,0,0,0,0,0,0,0,0,0,0,0,1]
[{"$f":"IF(Runden!A31=\"\",\"\",Runden!A31)","v":""},{"$f":"IF(Runden!B31>0,RANK(Runden!B31,Runden!B$4:B$53,0),0)","v":0},{"$f":"IF(Runden!C31>0,RANK(Runden!C31,Runden!C$4:C$53,0),0)","v":0},{"$f":"IF(Runden!D31>0,RANK(Runden!D31,Runden!D$4:D$53,0),0)","v":0},{"$f":"IF(Runden!E31>0,RANK(Runden!E31,Runden!E$4:E$53,0),0)","v":0},{"$f":"IF(Runden!F31>0,RANK(Runden!F31,Runden!F$4:F$53,0),0)","v":0},{"$f":"IF(Runden!G31>0,RANK(Runden!G31,Runden!G$4:G$53,0),0)","v":0},{"$f":"IF(Runden!H31>0,RANK(Runden!H31,Runden!H$4:H$53,0),0)","v":0},{"$f":"IF(Runden!I31>0,RANK(Runden!I31,Runden!I$4:I$53,0),0)","v":0},{"$f":"IF(Runden!J31>0,RANK(Runden!J31,Runden!J$4:J$53,0),0)","v":0},{"$f":"IF(Runden!K31>0,RANK(Runden!K31,Runden!K$4:K$53,0),0)","v":0},{"$f":"IF(Runden!L31>0,RANK(Runden!L31,Runden!L$4:L$53,0),0)","v":0},{"$f":"IF(Runden!M31>0,RANK(Runden!M31,Runden!M$4:M$53,0),0)","v":0},{"$f":"IF(Runden!N31>0,RANK(Runden!N31,Runden!N$4:N$53,0),0)","v":0},{"$f":"IF(Runden!O31>0,RANK(Runden!O31,Runden!O$4:O$53,0),0)","v":0},{"$f":"IF(Runden!P31>0,RANK(Runden!P31,Runden!P$4:P$53,0),0)","v":0},{"$f":"IF(Runden!Q31>0,RANK(Runden!Q31,Runden!Q$4:Q$53,0),0)","v":0},{"$f":"IF(Runden!R31>0,RANK(Runden!R31,Runden!R$4:R$53,0),0)","v":0},{"$f":"IF(Runden!S31>0,RANK(Runden!S31,Runden!S$4:S$53,0),0)","v":0},{"$f":"IF(Runden!T31>0,RANK(Runden!T31,Runden!T$4:T$53,0),0)","v":0},{"$f":"IF(Runden!U31>0,RANK(Runden!U31,Runden!U$4:U$53,0),0)","v":0},null,0,0,0,0,0,0,0,0,0,0,0,0,0,0,0,0,0,0,0,0,0,0,0,0,1,0,0,0,0,0,0,0,0,0,0,0,0,0,0,0,0,0,0,0,0,0,0,0,0,0,0,0,0,0,0,0,0,0,0,1]
[{"$f":"IF(Runden!A32=\"\",\"\",Runden!A32)","v":""},{"$f":"IF(Runden!B32>0,RANK(Runden!B32,Runden!B$4:B$53,0),0)","v":0},{"$f":"IF(Runden!C32>0,RANK(Runden!C32,Runden!C$4:C$53,0),0)","v":0},{"$f":"IF(Runden!D32>0,RANK(Runden!D32,Runden!D$4:D$53,0),0)","v":0},{"$f":"IF(Runden!E32>0,RANK(Runden!E32,Runden!E$4:E$53,0),0)","v":0},{"$f":"IF(Runden!F32>0,RANK(Runden!F32,Runden!F$4:F$53,0),0)","v":0},{"$f":"IF(Runden!G32>0,RANK(Runden!G32,Runden!G$4:G$53,0),0)","v":0},{"$f":"IF(Runden!H32>0,RANK(Runden!H32,Runden!H$4:H$53,0),0)","v":0},{"$f":"IF(Runden!I32>0,RANK(Runden!I32,Runden!I$4:I$53,0),0)","v":0},{"$f":"IF(Runden!J32>0,RANK(Runden!J32,Runden!J$4:J$53,0),0)","v":0},{"$f":"IF(Runden!K32>0,RANK(Runden!K32,Runden!K$4:K$53,0),0)","v":0},{"$f":"IF(Runden!L32>0,RANK(Runden!L32,Runden!L$4:L$53,0),0)","v":0},{"$f":"IF(Runden!M32>0,RANK(Runden!M32,Runden!M$4:M$53,0),0)","v":0},{"$f":"IF(Runden!N32>0,RANK(Runden!N32,Runden!N$4:N$53,0),0)","v":0},{"$f":"IF(Runden!O32>0,RANK(Runden!O32,Runden!O$4:O$53,0),0)","v":0},{"$f":"IF(Runden!P32>0,RANK(Runden!P32,Runden!P$4:P$53,0),0)","v":0},{"$f":"IF(Runden!Q32>0,RANK(Runden!Q32,Runden!Q$4:Q$53,0),0)","v":0},{"$f":"IF(Runden!R32>0,RANK(Runden!R32,Runden!R$4:R$53,0),0)","v":0},{"$f":"IF(Runden!S32>0,RANK(Runden!S32,Runden!S$4:S$53,0),0)","v":0},{"$f":"IF(Runden!T32>0,RANK(Runden!T32,Runden!T$4:T$53,0),0)","v":0},{"$f":"IF(Runden!U32>0,RANK(Runden!U32,Runden!U$4:U$53,0),0)","v":0},null,0,0,0,0,0,0,0,0,0,0,0,0,0,0,0,0,0,0,0,0,0,0,0,0,1,0,0,0,0,0,0,0,0,0,0,0,0,0,0,0,0,0,0,0,0,0,0,0,0,0,0,0,0,0,0,0,0,0,0,1]
[{"$f":"IF(Runden!A33=\"\",\"\",Runden!A33)","v":""},{"$f":"IF(Runden!B33>0,RANK(Runden!B33,Runden!B$4:B$53,0),0)","v":0},{"$f":"IF(Runden!C33>0,RANK(Runden!C33,Runden!C$4:C$53,0),0)","v":0},{"$f":"IF(Runden!D33>0,RANK(Runden!D33,Runden!D$4:D$53,0),0)","v":0},{"$f":"IF(Runden!E33>0,RANK(Runden!E33,Runden!E$4:E$53,0),0)","v":0},{"$f":"IF(Runden!F33>0,RANK(Runden!F33,Runden!F$4:F$53,0),0)","v":0},{"$f":"IF(Runden!G33>0,RANK(Runden!G33,Runden!G$4:G$53,0),0)","v":0},{"$f":"IF(Runden!H33>0,RANK(Runden!H33,Runden!H$4:H$53,0),0)","v":0},{"$f":"IF(Runden!I33>0,RANK(Runden!I33,Runden!I$4:I$53,0),0)","v":0},{"$f":"IF(Runden!J33>0,RANK(Runden!J33,Runden!J$4:J$53,0),0)","v":0},{"$f":"IF(Runden!K33>0,RANK(Runden!K33,Runden!K$4:K$53,0),0)","v":0},{"$f":"IF(Runden!L33>0,RANK(Runden!L33,Runden!L$4:L$53,0),0)","v":0},{"$f":"IF(Runden!M33>0,RANK(Runden!M33,Runden!M$4:M$53,0),0)","v":0},{"$f":"IF(Runden!N33>0,RANK(Runden!N33,Runden!N$4:N$53,0),0)","v":0},{"$f":"IF(Runden!O33>0,RANK(Runden!O33,Runden!O$4:O$53,0),0)","v":0},{"$f":"IF(Runden!P33>0,RANK(Runden!P33,Runden!P$4:P$53,0),0)","v":0},{"$f":"IF(Runden!Q33>0,RANK(Runden!Q33,Runden!Q$4:Q$53,0),0)","v":0},{"$f":"IF(Runden!R33>0,RANK(Runden!R33,Runden!R$4:R$53,0),0)","v":0},{"$f":"IF(Runden!S33>0,RANK(Runden!S33,Runden!S$4:S$53,0),0)","v":0},{"$f":"IF(Runden!T33>0,RANK(Runden!T33,Runden!T$4:T$53,0),0)","v":0},{"$f":"IF(Runden!U33>0,RANK(Runden!U33,Runden!U$4:U$53,0),0)","v":0},null,0,0,0,0,0,0,0,0,0,0,0,0,0,0,0,0,0,0,0,0,0,0,0,0,1,0,0,0,0,0,0,0,0,0,0,0,0,0,0,0,0,0,0,0,0,0,0,0,0,0,0,0,0,0,0,0,0,0,0,1]
[{"$f":"IF(Runden!A34=\"\",\"\",Runden!A34)","v":""},{"$f":"IF(Runden!B34>0,RANK(Runden!B34,Runden!B$4:B$53,0),0)","v":0},{"$f":"IF(Runden!C34>0,RANK(Runden!C34,Runden!C$4:C$53,0),0)","v":0},{"$f":"IF(Runden!D34>0,RANK(Runden!D34,Runden!D$4:D$53,0),0)","v":0},{"$f":"IF(Runden!E34>0,RANK(Runden!E34,Runden!E$4:E$53,0),0)","v":0},{"$f":"IF(Runden!F34>0,RANK(Runden!F34,Runden!F$4:F$53,0),0)","v":0},{"$f":"IF(Runden!G34>0,RANK(Runden!G34,Runden!G$4:G$53,0),0)","v":0},{"$f":"IF(Runden!H34>0,RANK(Runden!H34,Runden!H$4:H$53,0),0)","v":0},{"$f":"IF(Runden!I34>0,RANK(Runden!I34,Runden!I$4:I$53,0),0)","v":0},{"$f":"IF(Runden!J34>0,RANK(Runden!J34,Runden!J$4:J$53,0),0)","v":0},{"$f":"IF(Runden!K34>0,RANK(Runden!K34,Runden!K$4:K$53,0),0)","v":0},{"$f":"IF(Runden!L34>0,RANK(Runden!L34,Runden!L$4:L$53,0),0)","v":0},{"$f":"IF(Runden!M34>0,RANK(Runden!M34,Runden!M$4:M$53,0),0)","v":0},{"$f":"IF(Runden!N34>0,RANK(Runden!N34,Runden!N$4:N$53,0),0)","v":0},{"$f":"IF(Runden!O34>0,RANK(Runden!O34,Runden!O$4:O$53,0),0)","v":0},{"$f":"IF(Runden!P34>0,RANK(Runden!P34,Runden!P$4:P$53,0),0)","v":0},{"$f":"IF(Runden!Q34>0,RANK(Runden!Q34,Runden!Q$4:Q$53,0),0)","v":0},{"$f":"IF(Runden!R34>0,RANK(Runden!R34,Runden!R$4:R$53,0),0)","v":0},{"$f":"IF(Runden!S34>0,RANK(Runden!S34,Runden!S$4:S$53,0),0)","v":0},{"$f":"IF(Runden!T34>0,RANK(Runden!T34,Runden!T$4:T$53,0),0)","v":0},{"$f":"IF(Runden!U34>0,RANK(Runden!U34,Runden!U$4:U$53,0),0)","v":0},null,0,0,0,0,0,0,0,0,0,0,0,0,0,0,0,0,0,0,0,0,0,0,0,0,1,0,0,0,0,0,0,0,0,0,0,0,0,0,0,0,0,0,0,0,0,0,0,0,0,0,0,0,0,0,0,0,0,0,0,1]
[{"$f":"IF(Runden!A35=\"\",\"\",Runden!A35)","v":""},{"$f":"IF(Runden!B35>0,RANK(Runden!B35,Runden!B$4:B$53,0),0)","v":0},{"$f":"IF(Runden!C35>0,RANK(Runden!C35,Runden!C$4:C$53,0),0)","v":0},{"$f":"IF(Runden!D35>0,RANK(Runden!D35,Runden!D$4:D$53,0),0)","v":0},{"$f":"IF(Runden!E35>0,RANK(Runden!E35,Runden!E$4:E$53,0),0)","v":0},{"$f":"IF(Runden!F35>0,RANK(Runden!F35,Runden!F$4:F$53,0),0)","v":0},{"$f":"IF(Runden!G35>0,RANK(Runden!G35,Runden!G$4:G$53,0),0)","v":0},{"$f":"IF(Runden!H35>0,RANK(Runden!H35,Runden!H$4:H$53,0),0)","v":0},{"$f":"IF(Runden!I35>0,RANK(Runden!I35,Runden!I$4:I$53,0),0)","v":0},{"$f":"IF(Runden!J35>0,RANK(Runden!J35,Runden!J$4:J$53,0),0)","v":0},{"$f":"IF(Runden!K35>0,RANK(Runden!K35,Runden!K$4:K$53,0),0)","v":0},{"$f":"IF(Runden!L35>0,RANK(Runden!L35,Runden!L$4:L$53,0),0)","v":0},{"$f":"IF(Runden!M35>0,RANK(Runden!M35,Runden!M$4:M$53,0),0)","v":0},{"$f":"IF(Runden!N35>0,RANK(Runden!N35,Runden!N$4:N$53,0),0)","v":0},{"$f":"IF(Runden!O35>0,RANK(Runden!O35,Runden!O$4:O$53,0),0)","v":0},{"$f":"IF(Runden!P35>0,RANK(Runden!P35,Runden!P$4:P$53,0),0)","v":0},{"$f":"IF(Runden!Q35>0,RANK(Runden!Q35,Runden!Q$4:Q$53,0),0)","v":0},{"$f":"IF(Runden!R35>0,RANK(Runden!R35,Runden!R$4:R$53,0),0)","v":0},{"$f":"IF(Runden!S35>0,RANK(Runden!S35,Runden!S$4:S$53,0),0)","v":0},{"$f":"IF(Runden!T35>0,RANK(Runden!T35,Runden!T$4:T$53,0),0)","v":0},{"$f":"IF(Runden!U35>0,RANK(Runden!U35,Runden!U$4:U$53,0),0)","v":0},null,0,0,0,0,0,0,0,0,0,0,0,0,0,0,0,0,0,0,0,0,0,0,0,0,1,0,0,0,0,0,0,0,0,0,0,0,0,0,0,0,0,0,0,0,0,0,0,0,0,0,0,0,0,0,0,0,0,0,0,1]
[{"$f":"IF(Runden!A36=\"\",\"\",Runden!A36)","v":""},{"$f":"IF(Runden!B36>0,RANK(Runden!B36,Runden!B$4:B$53,0),0)","v":0},{"$f":"IF(Runden!C36>0,RANK(Runden!C36,Runden!C$4:C$53,0),0)","v":0},{"$f":"IF(Runden!D36>0,RANK(Runden!D36,Runden!D$4:D$53,0),0)","v":0},{"$f":"IF(Runden!E36>0,RANK(Runden!E36,Runden!E$4:E$53,0),0)","v":0},{"$f":"IF(Runden!F36>0,RANK(Runden!F36,Runden!F$4:F$53,0),0)","v":0},{"$f":"IF(Runden!G36>0,RANK(Runden!G36,Runden!G$4:G$53,0),0)","v":0},{"$f":"IF(Runden!H36>0,RANK(Runden!H36,Runden!H$4:H$53,0),0)","v":0},{"$f":"IF(Runden!I36>0,RANK(Runden!I36,Runden!I$4:I$53,0),0)","v":0},{"$f":"IF(Runden!J36>0,RANK(Runden!J36,Runden!J$4:J$53,0),0)","v":0},{"$f":"IF(Runden!K36>0,RANK(Runden!K36,Runden!K$4:K$53,0),0)","v":0},{"$f":"IF(Runden!L36>0,RANK(Runden!L36,Runden!L$4:L$53,0),0)","v":0},{"$f":"IF(Runden!M36>0,RANK(Runden!M36,Runden!M$4:M$53,0),0)","v":0},{"$f":"IF(Runden!N36>0,RANK(Runden!N36,Runden!N$4:N$53,0),0)","v":0},{"$f":"IF(Runden!O36>0,RANK(Runden!O36,Runden!O$4:O$53,0),0)","v":0},{"$f":"IF(Runden!P36>0,RANK(Runden!P36,Runden!P$4:P$53,0),0)","v":0},{"$f":"IF(Runden!Q36>0,RANK(Runden!Q36,Runden!Q$4:Q$53,0),0)","v":0},{"$f":"IF(Runden!R36>0,RANK(Runden!R36,Runden!R$4:R$53,0),0)","v":0},{"$f":"IF(Runden!S36>0,RANK(Runden!S36,Runden!S$4:S$53,0),0)","v":0},{"$f":"IF(Runden!T36>0,RANK(Runden!T36,Runden!T$4:T$53,0),0)","v":0},{"$f":"IF(Runden!U36>0,RANK(Runden!U36,Runden!U$4:U$53,0),0)","v":0},null,0,0,0,0,0,0,0,0,0,0,0,0,0,0,0,0,0,0,0,0,0,0,0,0,1,0,0,0,0,0,0,0,0,{"$f":"SUM(AV36:BC36)","v":0},0,0,0,0,0,0,0,0,0,0,{"$f":"SUM(BG36:BN36)","v":0},0,0,0,0,0,0,0,0,0,0,{"$f":"SUM(BR36:BY36)","v":0},0,0,0,1]
[{"$f":"IF(Runden!A37=\"\",\"\",Runden!A37)","v":""},{"$f":"IF(Runden!B37>0,RANK(Runden!B37,Runden!B$4:B$53,0),0)","v":0},{"$f":"IF(Runden!C37>0,RANK(Runden!C37,Runden!C$4:C$53,0),0)","v":0},{"$f":"IF(Runden!D37>0,RANK(Runden!D37,Runden!D$4:D$53,0),0)","v":0},{"$f":"IF(Runden!E37>0,RANK(Runden!E37,Runden!E$4:E$53,0),0)","v":0},{"$f":"IF(Runden!F37>0,RANK(Runden!F37,Runden!F$4:F$53,0),0)","v":0},{"$f":"IF(Runden!G37>0,RANK(Runden!G37,Runden!G$4:G$53,0),0)","v":0},{"$f":"IF(Runden!H37>0,RANK(Runden!H37,Runden!H$4:H$53,0),0)","v":0},{"$f":"IF(Runden!I37>0,RANK(Runden!I37,Runden!I$4:I$53,0),0)","v":0},{"$f":"IF(Runden!J37>0,RANK(Runden!J37,Runden!J$4:J$53,0),0)","v":0},{"$f":"IF(Runden!K37>0,RANK(Runden!K37,Runden!K$4:K$53,0),0)","v":0},{"$f":"IF(Runden!L37>0,RANK(Runden!L37,Runden!L$4:L$53,0),0)","v":0},{"$f":"IF(Runden!M37>0,RANK(Runden!M37,Runden!M$4:M$53,0),0)","v":0},{"$f":"IF(Runden!N37>0,RANK(Runden!N37,Runden!N$4:N$53,0),0)","v":0},{"$f":"IF(Runden!O37>0,RANK(Runden!O37,Runden!O$4:O$53,0),0)","v":0},{"$f":"IF(Runden!P37>0,RANK(Runden!P37,Runden!P$4:P$53,0),0)","v":0},{"$f":"IF(Runden!Q37>0,RANK(Runden!Q37,Runden!Q$4:Q$53,0),0)","v":0},{"$f":"IF(Runden!R37>0,RANK(Runden!R37,Runden!R$4:R$53,0),0)","v":0},{"$f":"IF(Runden!S37>0,RANK(Runden!S37,Runden!S$4:S$53,0),0)","v":0},{"$f":"IF(Runden!T37>0,RANK(Runden!T37,Runden!T$4:T$53,0),0)","v":0},{"$f":"IF(Runden!U37>0,RANK(Runden!U37,Runden!U$4:U$53,0),0)","v":0},null,0,0,0,0,0,0,0,0,0,0,0,0,0,0,0,0,0,0,0,0,0,0,0,0,1,0,0,0,0,0,0,0,0,0,0,0,0,0,0,0,0,0,0,0,0,0,0,0,0,0,0,0,0,0,0,0,0,0,0,1]
[{"$f":"IF(Runden!A38=\"\",\"\",Runden!A38)","v":""},{"$f":"IF(Runden!B38>0,RANK(Runden!B38,Runden!B$4:B$53,0),0)","v":0},{"$f":"IF(Runden!C38>0,RANK(Runden!C38,Runden!C$4:C$53,0),0)","v":0},{"$f":"IF(Runden!D38>0,RANK(Runden!D38,Runden!D$4:D$53,0),0)","v":0},{"$f":"IF(Runden!E38>0,RANK(Runden!E38,Runden!E$4:E$53,0),0)","v":0},{"$f":"IF(Runden!F38>0,RANK(Runden!F38,Runden!F$4:F$53,0),0)","v":0},{"$f":"IF(Runden!G38>0,RANK(Runden!G38,Runden!G$4:G$53,0),0)","v":0},{"$f":"IF(Runden!H38>0,RANK(Runden!H38,Runden!H$4:H$53,0),0)","v":0},{"$f":"IF(Runden!I38>0,RANK(Runden!I38,Runden!I$4:I$53,0),0)","v":0},{"$f":"IF(Runden!J38>0,RANK(Runden!J38,Runden!J$4:J$53,0),0)","v":0},{"$f":"IF(Runden!K38>0,RANK(Runden!K38,Runden!K$4:K$53,0),0)","v":0},{"$f":"IF(Runden!L38>0,RANK(Runden!L38,Runden!L$4:L$53,0),0)","v":0},{"$f":"IF(Runden!M38>0,RANK(Runden!M38,Runden!M$4:M$53,0),0)","v":0},{"$f":"IF(Runden!N38>0,RANK(Runden!N38,Runden!N$4:N$53,0),0)","v":0},{"$f":"IF(Runden!O38>0,RANK(Runden!O38,Runden!O$4:O$53,0),0)","v":0},{"$f":"IF(Runden!P38>0,RANK(Runden!P38,Runden!P$4:P$53,0),0)","v":0},{"$f":"IF(Runden!Q38>0,RANK(Runden!Q38,Runden!Q$4:Q$53,0),0)","v":0},{"$f":"IF(Runden!R38>0,RANK(Runden!R38,Runden!R$4:R$53,0),0)","v":0},{"$f":"IF(Runden!S38>0,RANK(Runden!S38,Runden!S$4:S$53,0),0)","v":0},{"$f":"IF(Runden!T38>0,RANK(Runden!T38,Runden!T$4:T$53,0),0)","v":0},{"$f":"IF(Runden!U38>0,RANK(Runden!U38,Runden!U$4:U$53,0),0)","v":0},null,0,0,0,0,0,0,0,0,0,0,0,0,0,0,0,0,0,0,0,0,0,0,0,0,1,0,0,0,0,0,0,0,0,0,0,0,0,0,0,0,0,0,0,0,0,0,0,0,0,0,0,0,0,0,0,0,0,0,0,1]
[{"$f":"IF(Runden!A39=\"\",\"\",Runden!A39)","v":""},{"$f":"IF(Runden!B39>0,RANK(Runden!B39,Runden!B$4:B$53,0),0)","v":0},{"$f":"IF(Runden!C39>0,RANK(Runden!C39,Runden!C$4:C$53,0),0)","v":0},{"$f":"IF(Runden!D39>0,RANK(Runden!D39,Runden!D$4:D$53,0),0)","v":0},{"$f":"IF(Runden!E39>0,RANK(Runden!E39,Runden!E$4:E$53,0),0)","v":0},{"$f":"IF(Runden!F39>0,RANK(Runden!F39,Runden!F$4:F$53,0),0)","v":0},{"$f":"IF(Runden!G39>0,RANK(Runden!G39,Runden!G$4:G$53,0),0)","v":0},{"$f":"IF(Runden!H39>0,RANK(Runden!H39,Runden!H$4:H$53,0),0)","v":0},{"$f":"IF(Runden!I39>0,RANK(Runden!I39,Runden!I$4:I$53,0),0)","v":0},{"$f":"IF(Runden!J39>0,RANK(Runden!J39,Runden!J$4:J$53,0),0)","v":0},{"$f":"IF(Runden!K39>0,RANK(Runden!K39,Runden!K$4:K$53,0),0)","v":0},{"$f":"IF(Runden!L39>0,RANK(Runden!L39,Runden!L$4:L$53,0),0)","v":0},{"$f":"IF(Runden!M39>0,RANK(Runden!M39,Runden!M$4:M$53,0),0)","v":0},{"$f":"IF(Runden!N39>0,RANK(Runden!N39,Runden!N$4:N$53,0),0)","v":0},{"$f":"IF(Runden!O39>0,RANK(Runden!O39,Runden!O$4:O$53,0),0)","v":0},{"$f":"IF(Runden!P39>0,RANK(Runden!P39,Runden!P$4:P$53,0),0)","v":0},{"$f":"IF(Runden!Q39>0,RANK(Runden!Q39,Runden!Q$4:Q$53,0),0)","v":0},{"$f":"IF(Runden!R39>0,RANK(Runden!R39,Runden!R$4:R$53,0),0)","v":0},{"$f":"IF(Runden!S39>0,RANK(Runden!S39,Runden!S$4:S$53,0),0)","v":0},{"$f":"IF(Runden!T39>0,RANK(Runden!T39,Runden!T$4:T$53,0),0)","v":0},{"$f":"IF(Runden!U39>0,RANK(Runden!U39,Runden!U$4:U$53,0),0)","v":0},null,0,0,0,0,0,0,0,0,0,0,0,0,0,0,0,0,0,0,0,0,0,0,0,0,1,0,0,0,0,0,0,0,0,0,0,0,0,0,0,0,0,0,0,0,0,0,0,0,0,0,0,0,0,0,0,0,0,0,0,1]
[{"$f":"IF(Runden!A40=\"\",\"\",Runden!A40)","v":""},{"$f":"IF(Runden!B40>0,RANK(Runden!B40,Runden!B$4:B$53,0),0)","v":0},{"$f":"IF(Runden!C40>0,RANK(Runden!C40,Runden!C$4:C$53,0),0)","v":0},{"$f":"IF(Runden!D40>0,RANK(Runden!D40,Runden!D$4:D$53,0),0)","v":0},{"$f":"IF(Runden!E40>0,RANK(Runden!E40,Runden!E$4:E$53,0),0)","v":0},{"$f":"IF(Runden!F40>0,RANK(Runden!F40,Runden!F$4:F$53,0),0)","v":0},{"$f":"IF(Runden!G40>0,RANK(Runden!G40,Runden!G$4:G$53,0),0)","v":0},{"$f":"IF(Runden!H40>0,RANK(Runden!H40,Runden!H$4:H$53,0),0)","v":0},{"$f":"IF(Runden!I40>0,RANK(Runden!I40,Runden!I$4:I$53,0),0)","v":0},{"$f":"IF(Runden!J40>0,RANK(Runden!J40,Runden!J$4:J$53,0),0)","v":0},{"$f":"IF(Runden!K40>0,RANK(Runden!K40,Runden!K$4:K$53,0),0)","v":0},{"$f":"IF(Runden!L40>0,RANK(Runden!L40,Runden!L$4:L$53,0),0)","v":0},{"$f":"IF(Runden!M40>0,RANK(Runden!M40,Runden!M$4:M$53,0),0)","v":0},{"$f":"IF(Runden!N40>0,RANK(Runden!N40,Runden!N$4:N$53,0),0)","v":0},{"$f":"IF(Runden!O40>0,RANK(Runden!O40,Runden!O$4:O$53,0),0)","v":0},{"$f":"IF(Runden!P40>0,RANK(Runden!P40,Runden!P$4:P$53,0),0)","v":0},{"$f":"IF(Runden!Q40>0,RANK(Runden!Q40,Runden!Q$4:Q$53,0),0)","v":0},{"$f":"IF(Runden!R40>0,RANK(Runden!R40,Runden!R$4:R$53,0),0)","v":0},{"$f":"IF(Runden!S40>0,RANK(Runden!S40,Runden!S$4:S$53,0),0)","v":0},{"$f":"IF(Runden!T40>0,RANK(Runden!T40,Runden!T$4:T$53,0),0)","v":0},{"$f":"IF(Runden!U40>0,RANK(Runden!U40,Runden!U$4:U$53,0),0)","v":0},null,0,0,0,0,0,0,0,0,0,0,0,0,0,0,0,0,0,0,0,0,0,0,0,0,1,0,0,0,0,0,0,0,0,0,0,0,0,0,0,0,0,0,0,0,0,0,0,0,0,0,0,0,0,0,0,0,0,0,0,1]
[{"$f":"IF(Runden!A41=\"\",\"\",Runden!A41)","v":""},{"$f":"IF(Runden!B41>0,RANK(Runden!B41,Runden!B$4:B$53,0),0)","v":0},{"$f":"IF(Runden!C41>0,RANK(Runden!C41,Runden!C$4:C$53,0),0)","v":0},{"$f":"IF(Runden!D41>0,RANK(Runden!D41,Runden!D$4:D$53,0),0)","v":0},{"$f":"IF(Runden!E41>0,RANK(Runden!E41,Runden!E$4:E$53,0),0)","v":0},{"$f":"IF(Runden!F41>0,RANK(Runden!F41,Runden!F$4:F$53,0),0)","v":0},{"$f":"IF(Runden!G41>0,RANK(Runden!G41,Runden!G$4:G$53,0),0)","v":0},{"$f":"IF(Runden!H41>0,RANK(Runden!H41,Runden!H$4:H$53,0),0)","v":0},{"$f":"IF(Runden!I41>0,RANK(Runden!I41,Runden!I$4:I$53,0),0)","v":0},{"$f":"IF(Runden!J41>0,RANK(Runden!J41,Runden!J$4:J$53,0),0)","v":0},{"$f":"IF(Runden!K41>0,RANK(Runden!K41,Runden!K$4:K$53,0),0)","v":0},{"$f":"IF(Runden!L41>0,RANK(Runden!L41,Runden!L$4:L$53,0),0)","v":0},{"$f":"IF(Runden!M41>0,RANK(Runden!M41,Runden!M$4:M$53,0),0)","v":0},{"$f":"IF(Runden!N41>0,RANK(Runden!N41,Runden!N$4:N$53,0),0)","v":0},{"$f":"IF(Runden!O41>0,RANK(Runden!O41,Runden!O$4:O$53,0),0)","v":0},{"$f":"IF(Runden!P41>0,RANK(Runden!P41,Runden!P$4:P$53,0),0)","v":0},{"$f":"IF(Runden!Q41>0,RANK(Runden!Q41,Runden!Q$4:Q$53,0),0)","v":0},{"$f":"IF(Runden!R41>0,RANK(Runden!R41,Runden!R$4:R$53,0),0)","v":0},{"$f":"IF(Runden!S41>0,RANK(Runden!S41,Runden!S$4:S$53,0),0)","v":0},{"$f":"IF(Runden!T41>0,RANK(Runden!T41,Runden!T$4:T$53,0),0)","v":0},{"$f":"IF(Runden!U41>0,RANK(Runden!U41,Runden!U$4:U$53,0),0)","v":0},null,0,0,0,0,0,0,0,0,0,0,0,0,0,0,0,{"$f":"COUNTIF($B41:$U41,AL$3)","v":0},0,0,0,0,0,0,0,0,1,0,0,0,0,0,0,0,0,0,0,0,0,0,0,0,0,0,0,0,0,0,0,0,0,0,0,0,0,0,0,0,0,0,0,1]
[{"$f":"IF(Runden!A42=\"\",\"\",Runden!A42)","v":""},{"$f":"IF(Runden!B42>0,RANK(Runden!B42,Runden!B$4:B$53,0),0)","v":0},{"$f":"IF(Runden!C42>0,RANK(Runden!C42,Runden!C$4:C$53,0),0)","v":0},{"$f":"IF(Runden!D42>0,RANK(Runden!D42,Runden!D$4:D$53,0),0)","v":0},{"$f":"IF(Runden!E42>0,RANK(Runden!E42,Runden!E$4:E$53,0),0)","v":0},{"$f":"IF(Runden!F42>0,RANK(Runden!F42,Runden!F$4:F$53,0),0)","v":0},{"$f":"IF(Runden!G42>0,RANK(Runden!G42,Runden!G$4:G$53,0),0)","v":0},{"$f":"IF(Runden!H42>0,RANK(Runden!H42,Runden!H$4:H$53,0),0)","v":0},{"$f":"IF(Runden!I42>0,RANK(Runden!I42,Runden!I$4:I$53,0),0)","v":0},{"$f":"IF(Runden!J42>0,RANK(Runden!J42,Runden!J$4:J$53,0),0)","v":0},{"$f":"IF(Runden!K42>0,RANK(Runden!K42,Runden!K$4:K$53,0),0)","v":0},{"$f":"IF(Runden!L42>0,RANK(Runden!L42,Runden!L$4:L$53,0),0)","v":0},{"$f":"IF(Runden!M42>0,RANK(Runden!M42,Runden!M$4:M$53,0),0)","v":0},{"$f":"IF(Runden!N42>0,RANK(Runden!N42,Runden!N$4:N$53,0),0)","v":0},{"$f":"IF(Runden!O42>0,RANK(Runden!O42,Runden!O$4:O$53,0),0)","v":0},{"$f":"IF(Runden!P42>0,RANK(Runden!P42,Runden!P$4:P$53,0),0)","v":0},{"$f":"IF(Runden!Q42>0,RANK(Runden!Q42,Runden!Q$4:Q$53,0),0)","v":0},{"$f":"IF(Runden!R42>0,RANK(Runden!R42,Runden!R$4:R$53,0),0)","v":0},{"$f":"IF(Runden!S42>0,RANK(Runden!S42,Runden!S$4:S$53,0),0)","v":0},{"$f":"IF(Runden!T42>0,RANK(Runden!T42,Runden!T$4:T$53,0),0)","v":0},{"$f":"IF(Runden!U42>0,RANK(Runden!U42,Runden!U$4:U$53,0),0)","v":0},null,{"$f":"COUNTIF($B42:$U42,W$3)","v":0},0,0,0,0,0,0,0,0,0,0,0,0,0,0,0,0,0,0,0,0,0,0,0,1,0,0,0,0,0,0,0,0,0,0,0,0,0,0,0,0,0,0,0,0,0,0,0,0,0,0,0,0,0,0,0,0,0,0,1]
[{"$f":"IF(Runden!A43=\"\",\"\",Runden!A43)","v":""},{"$f":"IF(Runden!B43>0,RANK(Runden!B43,Runden!B$4:B$53,0),0)","v":0},{"$f":"IF(Runden!C43>0,RANK(Runden!C43,Runden!C$4:C$53,0),0)","v":0},{"$f":"IF(Runden!D43>0,RANK(Runden!D43,Runden!D$4:D$53,0),0)","v":0},{"$f":"IF(Runden!E43>0,RANK(Runden!E43,Runden!E$4:E$53,0),0)","v":0},{"$f":"IF(Runden!F43>0,RANK(Runden!F43,Runden!F$4:F$53,0),0)","v":0},{"$f":"IF(Runden!G43>0,RANK(Runden!G43,Runden!G$4:G$53,0),0)","v":0},{"$f":"IF(Runden!H43>0,RANK(Runden!H43,Runden!H$4:H$53,0),0)","v":0},{"$f":"IF(Runden!I43>0,RANK(Runden!I43,Runden!I$4:I$53,0),0)","v":0},{"$f":"IF(Runden!J43>0,RANK(Runden!J43,Runden!J$4:J$53,0),0)","v":0},{"$f":"IF(Runden!K43>0,RANK(Runden!K43,Runden!K$4:K$53,0),0)","v":0},{"$f":"IF(Runden!L43>0,RANK(Runden!L43,Runden!L$4:L$53,0),0)","v":0},{"$f":"IF(Runden!M43>0,RANK(Runden!M43,Runden!M$4:M$53,0),0)","v":0},{"$f":"IF(Runden!N43>0,RANK(Runden!N43,Runden!N$4:N$53,0),0)","v":0},{"$f":"IF(Runden!O43>0,RANK(Runden!O43,Runden!O$4:O$53,0),0)","v":0},{"$f":"IF(Runden!P43>0,RANK(Runden!P43,Runden!P$4:P$53,0),0)","v":0},{"$f":"IF(Runden!Q43>0,RANK(Runden!Q43,Runden!Q$4:Q$53,0),0)","v":0},{"$f":"IF(Runden!R43>0,RANK(Runden!R43,Runden!R$4:R$53,0),0)","v":0},{"$f":"IF(Runden!S43>0,RANK(Runden!S43,Runden!S$4:S$53,0),0)","v":0},{"$f":"IF(Runden!T43>0,RANK(Runden!T43,Runden!T$4:T$53,0),0)","v":0},{"$f":"IF(Runden!U43>0,RANK(Runden!U43,Runden!U$4:U$53,0),0)","v":0},null,0,0,0,0,0,0,0,0,0,0,0,0,0,0,0,0,0,0,0,0,0,0,0,0,1,0,0,0,0,0,0,0,0,0,0,0,0,0,0,0,0,0,0,0,0,0,0,0,0,0,0,0,0,0,0,0,0,0,0,1]
[{"$f":"IF(Runden!A44=\"\",\"\",Runden!A44)","v":""},{"$f":"IF(Runden!B44>0,RANK(Runden!B44,Runden!B$4:B$53,0),0)","v":0},{"$f":"IF(Runden!C44>0,RANK(Runden!C44,Runden!C$4:C$53,0),0)","v":0},{"$f":"IF(Runden!D44>0,RANK(Runden!D44,Runden!D$4:D$53,0),0)","v":0},{"$f":"IF(Runden!E44>0,RANK(Runden!E44,Runden!E$4:E$53,0),0)","v":0},{"$f":"IF(Runden!F44>0,RANK(Runden!F44,Runden!F$4:F$53,0),0)","v":0},{"$f":"IF(Runden!G44>0,RANK(Runden!G44,Runden!G$4:G$53,0),0)","v":0},{"$f":"IF(Runden!H44>0,RANK(Runden!H44,Runden!H$4:H$53,0),0)","v":0},{"$f":"IF(Runden!I44>0,RANK(Runden!I44,Runden!I$4:I$53,0),0)","v":0},{"$f":"IF(Runden!J44>0,RANK(Runden!J44,Runden!J$4:J$53,0),0)","v":0},{"$f":"IF(Runden!K44>0,RANK(Runden!K44,Runden!K$4:K$53,0),0)","v":0},{"$f":"IF(Runden!L44>0,RANK(Runden!L44,Runden!L$4:L$53,0),0)","v":0},{"$f":"IF(Runden!M44>0,RANK(Runden!M44,Runden!M$4:M$53,0),0)","v":0},{"$f":"IF(Runden!N44>0,RANK(Runden!N44,Runden!N$4:N$53,0),0)","v":0},{"$f":"IF(Runden!O44>0,RANK(Runden!O44,Runden!O$4:O$53,0),0)","v":0},{"$f":"IF(Runden!P44>0,RANK(Runden!P44,Runden!P$4:P$53,0),0)","v":0},{"$f":"IF(Runden!Q44>0,RANK(Runden!Q44,Runden!Q$4:Q$53,0),0)","v":0},{"$f":"IF(Runden!R44>0,RANK(Runden!R44,Runden!R$4:R$53,0),0)","v":0},{"$f":"IF(Runden!S44>0,RANK(Runden!S44,Runden!S$4:S$53,0),0)","v":0},{"$f":"IF(Runden!T44>0,RANK(Runden!T44,Runden!T$4:T$53,0),0)","v":0},{"$f":"IF(Runden!U44>0,RANK(Runden!U44,Runden!U$4:U$53,0),0)","v":0},null,0,0,0,0,0,0,0,0,0,0,0,0,0,0,0,0,0,0,0,0,0,0,0,0,1,0,0,0,0,0,0,0,0,0,0,0,0,0,0,0,0,0,0,0,0,0,0,0,0,0,0,0,0,0,0,0,0,0,0,1]
[{"$f":"IF(Runden!A45=\"\",\"\",Runden!A45)","v":""},{"$f":"IF(Runden!B45>0,RANK(Runden!B45,Runden!B$4:B$53,0),0)","v":0},{"$f":"IF(Runden!C45>0,RANK(Runden!C45,Runden!C$4:C$53,0),0)","v":0},{"$f":"IF(Runden!D45>0,RANK(Runden!D45,Runden!D$4:D$53,0),0)","v":0},{"$f":"IF(Runden!E45>0,RANK(Runden!E45,Runden!E$4:E$53,0),0)","v":0},{"$f":"IF(Runden!F45>0,RANK(Runden!F45,Runden!F$4:F$53,0),0)","v":0},{"$f":"IF(Runden!G45>0,RANK(Runden!G45,Runden!G$4:G$53,0),0)","v":0},{"$f":"IF(Runden!H45>0,RANK(Runden!H45,Runden!H$4:H$53,0),0)","v":0},{"$f":"IF(Runden!I45>0,RANK(Runden!I45,Runden!I$4:I$53,0),0)","v":0},{"$f":"IF(Runden!J45>0,RANK(Runden!J45,Runden!J$4:J$53,0),0)","v":0},{"$f":"IF(Runden!K45>0,RANK(Runden!K45,Runden!K$4:K$53,0),0)","v":0},{"$f":"IF(Runden!L45>0,RANK(Runden!L45,Runden!L$4:L$53,0),0)","v":0},{"$f":"IF(Runden!M45>0,RANK(Runden!M45,Runden!M$4:M$53,0),0)","v":0},{"$f":"IF(Runden!N45>0,RANK(Runden!N45,Runden!N$4:N$53,0),0)","v":0},{"$f":"IF(Runden!O45>0,RANK(Runden!O45,Runden!O$4:O$53,0),0)","v":0},{"$f":"IF(Runden!P45>0,RANK(Runden!P45,Runden!P$4:P$53,0),0)","v":0},{"$f":"IF(Runden!Q45>0,RANK(Runden!Q45,Runden!Q$4:Q$53,0),0)","v":0},{"$f":"IF(Runden!R45>0,RANK(Runden!R45,Runden!R$4:R$53,0),0)","v":0},{"$f":"IF(Runden!S45>0,RANK(Runden!S45,Runden!S$4:S$53,0),0)","v":0},{"$f":"IF(Runden!T45>0,RANK(Runden!T45,Runden!T$4:T$53,0),0)","v":0},{"$f":"IF(Runden!U45>0,RANK(Runden!U45,Runden!U$4:U$53,0),0)","v":0},null,0,0,0,0,0,0,0,0,0,0,0,0,0,0,0,0,0,0,0,0,0,0,0,0,1,0,0,0,0,0,0,0,0,0,0,0,0,0,0,0,0,0,0,0,0,0,0,0,0,0,0,0,0,0,0,0,0,0,0,1]
[{"$f":"IF(Runden!A46=\"\",\"\",Runden!A46)","v":""},{"$f":"IF(Runden!B46>0,RANK(Runden!B46,Runden!B$4:B$53,0),0)","v":0},{"$f":"IF(Runden!C46>0,RANK(Runden!C46,Runden!C$4:C$53,0),0)","v":0},{"$f":"IF(Runden!D46>0,RANK(Runden!D46,Runden!D$4:D$53,0),0)","v":0},{"$f":"IF(Runden!E46>0,RANK(Runden!E46,Runden!E$4:E$53,0),0)","v":0},{"$f":"IF(Runden!F46>0,RANK(Runden!F46,Runden!F$4:F$53,0),0)","v":0},{"$f":"IF(Runden!G46>0,RANK(Runden!G46,Runden!G$4:G$53,0),0)","v":0},{"$f":"IF(Runden!H46>0,RANK(Runden!H46,Runden!H$4:H$53,0),0)","v":0},{"$f":"IF(Runden!I46>0,RANK(Runden!I46,Runden!I$4:I$53,0),0)","v":0},{"$f":"IF(Runden!J46>0,RANK(Runden!J46,Runden!J$4:J$53,0),0)","v":0},{"$f":"IF(Runden!K46>0,RANK(Runden!K46,Runden!K$4:K$53,0),0)","v":0},{"$f":"IF(Runden!L46>0,RANK(Runden!L46,Runden!L$4:L$53,0),0)","v":0},{"$f":"IF(Runden!M46>0,RANK(Runden!M46,Runden!M$4:M$53,0),0)","v":0},{"$f":"IF(Runden!N46>0,RANK(Runden!N46,Runden!N$4:N$53,0),0)","v":0},{"$f":"IF(Runden!O46>0,RANK(Runden!O46,Runden!O$4:O$53,0),0)","v":0},{"$f":"IF(Runden!P46>0,RANK(Runden!P46,Runden!P$4:P$53,0),0)","v":0},{"$f":"IF(Runden!Q46>0,RANK(Runden!Q46,Runden!Q$4:Q$53,0),0)","v":0},{"$f":"IF(Runden!R46>0,RANK(Runden!R46,Runden!R$4:R$53,0),0)","v":0},{"$f":"IF(Runden!S46>0,RANK(Runden!S46,Runden!S$4:S$53,0),0)","v":0},{"$f":"IF(Runden!T46>0,RANK(Runden!T46,Runden!T$4:T$53,0),0)","v":0},{"$f":"IF(Runden!U46>0,RANK(Runden!U46,Runden!U$4:U$53,0),0)","v":0},null,0,0,0,0,0,0,0,0,0,0,0,0,0,0,0,0,0,0,0,0,0,0,0,0,1,0,0,0,0,0,0,0,0,0,0,0,0,0,0,0,0,0,0,0,0,0,0,0,0,0,0,0,0,0,0,0,0,0,0,1]
[{"$f":"IF(Runden!A47=\"\",\"\",Runden!A47)","v":""},{"$f":"IF(Runden!B47>0,RANK(Runden!B47,Runden!B$4:B$53,0),0)","v":0},{"$f":"IF(Runden!C47>0,RANK(Runden!C47,Runden!C$4:C$53,0),0)","v":0},{"$f":"IF(Runden!D47>0,RANK(Runden!D47,Runden!D$4:D$53,0),0)","v":0},{"$f":"IF(Runden!E47>0,RANK(Runden!E47,Runden!E$4:E$53,0),0)","v":0},{"$f":"IF(Runden!F47>0,RANK(Runden!F47,Runden!F$4:F$53,0),0)","v":0},{"$f":"IF(Runden!G47>0,RANK(Runden!G47,Runden!G$4:G$53,0),0)","v":0},{"$f":"IF(Runden!H47>0,RANK(Runden!H47,Runden!H$4:H$53,0),0)","v":0},{"$f":"IF(Runden!I47>0,RANK(Runden!I47,Runden!I$4:I$53,0),0)","v":0},{"$f":"IF(Runden!J47>0,RANK(Runden!J47,Runden!J$4:J$53,0),0)","v":0},{"$f":"IF(Runden!K47>0,RANK(Runden!K47,Runden!K$4:K$53,0),0)","v":0},{"$f":"IF(Runden!L47>0,RANK(Runden!L47,Runden!L$4:L$53,0),0)","v":0},{"$f":"IF(Runden!M47>0,RANK(Runden!M47,Runden!M$4:M$53,0),0)","v":0},{"$f":"IF(Runden!N47>0,RANK(Runden!N47,Runden!N$4:N$53,0),0)","v":0},{"$f":"IF(Runden!O47>0,RANK(Runden!O47,Runden!O$4:O$53,0),0)","v":0},{"$f":"IF(Runden!P47>0,RANK(Runden!P47,Runden!P$4:P$53,0),0)","v":0},{"$f":"IF(Runden!Q47>0,RANK(Runden!Q47,Runden!Q$4:Q$53,0),0)","v":0},{"$f":"IF(Runden!R47>0,RANK(Runden!R47,Runden!R$4:R$53,0),0)","v":0},{"$f":"IF(Runden!S47>0,RANK(Runden!S47,Runden!S$4:S$53,0),0)","v":0},{"$f":"IF(Runden!T47>0,RANK(Runden!T47,Runden!T$4:T$53,0),0)","v":0},{"$f":"IF(Runden!U47>0,RANK(Runden!U47,Runden!U$4:U$53,0),0)","v":0},null,0,0,0,0,0,0,0,0,0,0,0,0,0,0,0,0,0,0,0,0,0,0,0,0,1,0,0,0,0,0,0,0,0,0,0,0,0,0,0,0,0,0,0,0,0,0,0,0,0,0,0,0,0,0,0,0,0,0,0,1]
[{"$f":"IF(Runden!A48=\"\",\"\",Runden!A48)","v":""},{"$f":"IF(Runden!B48>0,RANK(Runden!B48,Runden!B$4:B$53,0),0)","v":0},{"$f":"IF(Runden!C48>0,RANK(Runden!C48,Runden!C$4:C$53,0),0)","v":0},{"$f":"IF(Runden!D48>0,RANK(Runden!D48,Runden!D$4:D$53,0),0)","v":0},{"$f":"IF(Runden!E48>0,RANK(Runden!E48,Runden!E$4:E$53,0),0)","v":0},{"$f":"IF(Runden!F48>0,RANK(Runden!F48,Runden!F$4:F$53,0),0)","v":0},{"$f":"IF(Runden!G48>0,RANK(Runden!G48,Runden!G$4:G$53,0),0)","v":0},{"$f":"IF(Runden!H48>0,RANK(Runden!H48,Runden!H$4:H$53,0),0)","v":0},{"$f":"IF(Runden!I48>0,RANK(Runden!I48,Runden!I$4:I$53,0),0)","v":0},{"$f":"IF(Runden!J48>0,RANK(Runden!J48,Runden!J$4:J$53,0),0)","v":0},{"$f":"IF(Runden!K48>0,RANK(Runden!K48,Runden!K$4:K$53,0),0)","v":0},{"$f":"IF(Runden!L48>0,RANK(Runden!L48,Runden!L$4:L$53,0),0)","v":0},{"$f":"IF(Runden!M48>0,RANK(Runden!M48,Runden!M$4:M$53,0),0)","v":0},{"$f":"IF(Runden!N48>0,RANK(Runden!N48,Runden!N$4:N$53,0),0)","v":0},{"$f":"IF(Runden!O48>0,RANK(Runden!O48,Runden!O$4:O$53,0),0)","v":0},{"$f":"IF(Runden!P48>0,RANK(Runden!P48,Runden!P$4:P$53,0),0)","v":0},{"$f":"IF(Runden!Q48>0,RANK(Runden!Q48,Runden!Q$4:Q$53,0),0)","v":0},{"$f":"IF(Runden!R48>0,RANK(Runden!R48,Runden!R$4:R$53,0),0)","v":0},{"$f":"IF(Runden!S48>0,RANK(Runden!S48,Runden!S$4:S$53,0),0)","v":0},{"$f":"IF(Runden!T48>0,RANK(Runden!T48,Runden!T$4:T$53,0),0)","v":0},{"$f":"IF(Runden!U48>0,RANK(Runden!U48,Runden!U$4:U$53,0),0)","v":0},null,0,0,0,0,0,0,0,0,0,0,0,0,0,0,0,0,0,0,0,0,0,0,0,0,1,0,0,0,0,0,0,0,0,0,0,0,0,0,0,0,0,0,0,0,0,0,0,0,0,0,0,0,0,0,0,0,0,0,0,1]
[{"$f":"IF(Runden!A49=\"\",\"\",Runden!A49)","v":""},{"$f":"IF(Runden!B49>0,RANK(Runden!B49,Runden!B$4:B$53,0),0)","v":0},{"$f":"IF(Runden!C49>0,RANK(Runden!C49,Runden!C$4:C$53,0),0)","v":0},{"$f":"IF(Runden!D49>0,RANK(Runden!D49,Runden!D$4:D$53,0),0)","v":0},{"$f":"IF(Runden!E49>0,RANK(Runden!E49,Runden!E$4:E$53,0),0)","v":0},{"$f":"IF(Runden!F49>0,RANK(Runden!F49,Runden!F$4:F$53,0),0)","v":0},{"$f":"IF(Runden!G49>0,RANK(Runden!G49,Runden!G$4:G$53,0),0)","v":0},{"$f":"IF(Runden!H49>0,RANK(Runden!H49,Runden!H$4:H$53,0),0)","v":0},{"$f":"IF(Runden!I49>0,RANK(Runden!I49,Runden!I$4:I$53,0),0)","v":0},{"$f":"IF(Runden!J49>0,RANK(Runden!J49,Runden!J$4:J$53,0),0)","v":0},{"$f":"IF(Runden!K49>0,RANK(Runden!K49,Runden!K$4:K$53,0),0)","v":0},{"$f":"IF(Runden!L49>0,RANK(Runden!L49,Runden!L$4:L$53,0),0)","v":0},{"$f":"IF(Runden!M49>0,RANK(Runden!M49,Runden!M$4:M$53,0),0)","v":0},{"$f":"IF(Runden!N49>0,RANK(Runden!N49,Runden!N$4:N$53,0),0)","v":0},{"$f":"IF(Runden!O49>0,RANK(Runden!O49,Runden!O$4:O$53,0),0)","v":0},{"$f":"IF(Runden!P49>0,RANK(Runden!P49,Runden!P$4:P$53,0),0)","v":0},{"$f":"IF(Runden!Q49>0,RANK(Runden!Q49,Runden!Q$4:Q$53,0),0)","v":0},{"$f":"IF(Runden!R49>0,RANK(Runden!R49,Runden!R$4:R$53,0),0)","v":0},{"$f":"IF(Runden!S49>0,RANK(Runden!S49,Runden!S$4:S$53,0),0)","v":0},{"$f":"IF(Runden!T49>0,RANK(Runden!T49,Runden!T$4:T$53,0),0)","v":0},{"$f":"IF(Runden!U49>0,RANK(Runden!U49,Runden!U$4:U$53,0),0)","v":0},null,0,0,0,0,0,0,0,0,0,0,0,0,0,0,0,0,0,0,0,0,0,0,0,0,1,0,0,0,0,0,0,0,0,0,0,0,0,0,0,0,0,0,0,0,0,0,0,0,0,0,0,0,0,0,0,0,0,0,0,1]
[{"$f":"IF(Runden!A50=\"\",\"\",Runden!A50)","v":""},{"$f":"IF(Runden!B50>0,RANK(Runden!B50,Runden!B$4:B$53,0),0)","v":0},{"$f":"IF(Runden!C50>0,RANK(Runden!C50,Runden!C$4:C$53,0),0)","v":0},{"$f":"IF(Runden!D50>0,RANK(Runden!D50,Runden!D$4:D$53,0),0)","v":0},{"$f":"IF(Runden!E50>0,RANK(Runden!E50,Runden!E$4:E$53,0),0)","v":0},{"$f":"IF(Runden!F50>0,RANK(Runden!F50,Runden!F$4:F$53,0),0)","v":0},{"$f":"IF(Runden!G50>0,RANK(Runden!G50,Runden!G$4:G$53,0),0)","v":0},{"$f":"IF(Runden!H50>0,RANK(Runden!H50,Runden!H$4:H$53,0),0)","v":0},{"$f":"IF(Runden!I50>0,RANK(Runden!I50,Runden!I$4:I$53,0),0)","v":0},{"$f":"IF(Runden!J50>0,RANK(Runden!J50,Runden!J$4:J$53,0),0)","v":0},{"$f":"IF(Runden!K50>0,RANK(Runden!K50,Runden!K$4:K$53,0),0)","v":0},{"$f":"IF(Runden!L50>0,RANK(Runden!L50,Runden!L$4:L$53,0),0)","v":0},{"$f":"IF(Runden!M50>0,RANK(Runden!M50,Runden!M$4:M$53,0),0)","v":0},{"$f":"IF(Runden!N50>0,RANK(Runden!N50,Runden!N$4:N$53,0),0)","v":0},{"$f":"IF(Runden!O50>0,RANK(Runden!O50,Runden!O$4:O$53,0),0)","v":0},{"$f":"IF(Runden!P50>0,RANK(Runden!P50,Runden!P$4:P$53,0),0)","v":0},{"$f":"IF(Runden!Q50>0,RANK(Runden!Q50,Runden!Q$4:Q$53,0),0)","v":0},{"$f":"IF(Runden!R50>0,RANK(Runden!R50,Runden!R$4:R$53,0),0)","v":0},{"$f":"IF(Runden!S50>0,RANK(Runden!S50,Runden!S$4:S$53,0),0)","v":0},{"$f":"IF(Runden!T50>0,RANK(Runden!T50,Runden!T$4:T$53,0),0)","v":0},{"$f":"IF(Runden!U50>0,RANK(Runden!U50,Runden!U$4:U$53,0),0)","v":0},null,0,0,0,0,0,0,0,0,0,0,0,0,0,0,0,0,0,0,0,0,0,0,0,0,1,0,0,0,0,0,0,0,0,0,0,0,0,0,0,0,0,0,0,0,0,0,0,0,0,0,0,0,0,0,0,0,0,0,0,1]
[{"$f":"IF(Runden!A51=\"\",\"\",Runden!A51)","v":""},{"$f":"IF(Runden!B51>0,RANK(Runden!B51,Runden!B$4:B$53,0),0)","v":0},{"$f":"IF(Runden!C51>0,RANK(Runden!C51,Runden!C$4:C$53,0),0)","v":0},{"$f":"IF(Runden!D51>0,RANK(Runden!D51,Runden!D$4:D$53,0),0)","v":0},{"$f":"IF(Runden!E51>0,RANK(Runden!E51,Runden!E$4:E$53,0),0)","v":0},{"$f":"IF(Runden!F51>0,RANK(Runden!F51,Runden!F$4:F$53,0),0)","v":0},{"$f":"IF(Runden!G51>0,RANK(Runden!G51,Runden!G$4:G$53,0),0)","v":0},{"$f":"IF(Runden!H51>0,RANK(Runden!H51,Runden!H$4:H$53,0),0)","v":0},{"$f":"IF(Runden!I51>0,RANK(Runden!I51,Runden!I$4:I$53,0),0)","v":0},{"$f":"IF(Runden!J51>0,RANK(Runden!J51,Runden!J$4:J$53,0),0)","v":0},{"$f":"IF(Runden!K51>0,RANK(Runden!K51,Runden!K$4:K$53,0),0)","v":0},{"$f":"IF(Runden!L51>0,RANK(Runden!L51,Runden!L$4:L$53,0),0)","v":0},{"$f":"IF(Runden!M51>0,RANK(Runden!M51,Runden!M$4:M$53,0),0)","v":0},{"$f":"IF(Runden!N51>0,RANK(Runden!N51,Runden!N$4:N$53,0),0)","v":0},{"$f":"IF(Runden!O51>0,RANK(Runden!O51,Runden!O$4:O$53,0),0)","v":0},{"$f":"IF(Runden!P51>0,RANK(Runden!P51,Runden!P$4:P$53,0),0)","v":0},{"$f":"IF(Runden!Q51>0,RANK(Runden!Q51,Runden!Q$4:Q$53,0),0)","v":0},{"$f":"IF(Runden!R51>0,RANK(Runden!R51,Runden!R$4:R$53,0),0)","v":0},{"$f":"IF(Runden!S51>0,RANK(Runden!S51,Runden!S$4:S$53,0),0)","v":0},{"$f":"IF(Runden!T51>0,RANK(Runden!T51,Runden!T$4:T$53,0),0)","v":0},{"$f":"IF(Runden!U51>0,RANK(Runden!U51,Runden!U$4:U$53,0),0)","v":0},null,0,0,0,0,0,0,0,0,0,0,0,0,0,0,0,0,0,0,0,0,0,0,0,0,1,0,0,0,0,0,0,0,0,0,0,0,0,0,0,0,0,0,0,0,0,0,0,0,0,0,0,0,0,0,0,0,0,0,0,1]
[{"$f":"IF(Runden!A52=\"\",\"\",Runden!A52)","v":""},{"$f":"IF(Runden!B52>0,RANK(Runden!B52,Runden!B$4:B$53,0),0)","v":0},{"$f":"IF(Runden!C52>0,RANK(Runden!C52,Runden!C$4:C$53,0),0)","v":0},{"$f":"IF(Runden!D52>0,RANK(Runden!D52,Runden!D$4:D$53,0),0)","v":0},{"$f":"IF(Runden!E52>0,RANK(Runden!E52,Runden!E$4:E$53,0),0)","v":0},{"$f":"IF(Runden!F52>0,RANK(Runden!F52,Runden!F$4:F$53,0),0)","v":0},{"$f":"IF(Runden!G52>0,RANK(Runden!G52,Runden!G$4:G$53,0),0)","v":0},{"$f":"IF(Runden!H52>0,RANK(Runden!H52,Runden!H$4:H$53,0),0)","v":0},{"$f":"IF(Runden!I52>0,RANK(Runden!I52,Runden!I$4:I$53,0),0)","v":0},{"$f":"IF(Runden!J52>0,RANK(Runden!J52,Runden!J$4:J$53,0),0)","v":0},{"$f":"IF(Runden!K52>0,RANK(Runden!K52,Runden!K$4:K$53,0),0)","v":0},{"$f":"IF(Runden!L52>0,RANK(Runden!L52,Runden!L$4:L$53,0),0)","v":0},{"$f":"IF(Runden!M52>0,RANK(Runden!M52,Runden!M$4:M$53,0),0)","v":0},{"$f":"IF(Runden!N52>0,RANK(Runden!N52,Runden!N$4:N$53,0),0)","v":0},{"$f":"IF(Runden!O52>0,RANK(Runden!O52,Runden!O$4:O$53,0),0)","v":0},{"$f":"IF(Runden!P52>0,RANK(Runden!P52,Runden!P$4:P$53,0),0)","v":0},{"$f":"IF(Runden!Q52>0,RANK(Runden!Q52,Runden!Q$4:Q$53,0),0)","v":0},{"$f":"IF(Runden!R52>0,RANK(Runden!R52,Runden!R$4:R$53,0),0)","v":0},{"$f":"IF(Runden!S52>0,RANK(Runden!S52,Runden!S$4:S$53,0),0)","v":0},{"$f":"IF(Runden!T52>0,RANK(Runden!T52,Runden!T$4:T$53,0),0)","v":0},{"$f":"IF(Runden!U52>0,RANK(Runden!U52,Runden!U$4:U$53,0),0)","v":0},null,0,0,0,0,0,0,0,0,0,0,0,0,0,0,0,0,0,0,0,0,0,0,0,0,1,0,0,0,0,0,0,0,0,0,0,0,0,0,0,0,0,0,0,0,0,0,0,0,0,0,0,0,0,0,0,0,0,0,0,1]
[{"$f":"IF(Runden!A53=\"\",\"\",Runden!A53)","v":""},{"$f":"IF(Runden!B53>0,RANK(Runden!B53,Runden!B$4:B$53,0),0)","v":0},{"$f":"IF(Runden!C53>0,RANK(Runden!C53,Runden!C$4:C$53,0),0)","v":0},{"$f":"IF(Runden!D53>0,RANK(Runden!D53,Runden!D$4:D$53,0),0)","v":0},{"$f":"IF(Runden!E53>0,RANK(Runden!E53,Runden!E$4:E$53,0),0)","v":0},{"$f":"IF(Runden!F53>0,RANK(Runden!F53,Runden!F$4:F$53,0),0)","v":0},{"$f":"IF(Runden!G53>0,RANK(Runden!G53,Runden!G$4:G$53,0),0)","v":0},{"$f":"IF(Runden!H53>0,RANK(Runden!H53,Runden!H$4:H$53,0),0)","v":0},{"$f":"IF(Runden!I53>0,RANK(Runden!I53,Runden!I$4:I$53,0),0)","v":0},{"$f":"IF(Runden!J53>0,RANK(Runden!J53,Runden!J$4:J$53,0),0)","v":0},{"$f":"IF(Runden!K53>0,RANK(Runden!K53,Runden!K$4:K$53,0),0)","v":0},{"$f":"IF(Runden!L53>0,RANK(Runden!L53,Runden!L$4:L$53,0),0)","v":0},{"$f":"IF(Runden!M53>0,RANK(Runden!M53,Runden!M$4:M$53,0),0)","v":0},{"$f":"IF(Runden!N53>0,RANK(Runden!N53,Runden!N$4:N$53,0),0)","v":0},{"$f":"IF(Runden!O53>0,RANK(Runden!O53,Runden!O$4:O$53,0),0)","v":0},{"$f":"IF(Runden!P53>0,RANK(Runden!P53,Runden!P$4:P$53,0),0)","v":0},{"$f":"IF(Runden!Q53>0,RANK(Runden!Q53,Runden!Q$4:Q$53,0),0)","v":0},{"$f":"IF(Runden!R53>0,RANK(Runden!R53,Runden!R$4:R$53,0),0)","v":0},{"$f":"IF(Runden!S53>0,RANK(Runden!S53,Runden!S$4:S$53,0),0)","v":0},{"$f":"IF(Runden!T53>0,RANK(Runden!T53,Runden!T$4:T$53,0),0)","v":0},{"$f":"IF(Runden!U53>0,RANK(Runden!U53,Runden!U$4:U$53,0),0)","v":0},null,0,0,0,0,0,0,0,0,0,0,0,0,0,0,0,0,0,0,0,0,0,0,0,0,1,0,0,0,0,0,0,0,0,0,0,0,0,0,0,0,0,0,0,0,0,0,0,0,0,0,0,0,0,0,0,0,0,0,0,1]

{"sheet":"Punkte","index":3,"n_rows":54,"n_cols":55,"rows_kept":54,"cut":false,"hidden":false,"merged":[[1,39,1,44],[1,30,1,36],[1,25,1,26],[1,21,1,23]]}
[{"$f":"Einstellungen!D9&\" (Punkte)\"","v":"DTM2019 (Punkte)"},null,null,null,null,null,null,null,null,null,null,null,null,null,null,null,null,null,null,null,null,null,"Ergebnis",null,"Gewertete",{"$f":"IF(AnzahlLäufeGefahren<LäufeInsgesamt,\"vorläufiger Endstand\", \"Endstand\")","v":"vorläufiger Endstand"},null,null,null,null,null,null,null,null,null,null,null,null,null,null,null,null,null,null,null,null,null,null,null,null,"Rang aus","1/1000sel aus","Wert aus","Rang aus","1/1000stel aus"]
[null,"1. Lauf","2. Lauf","3. Lauf","4. Lauf","5. Lauf","6. Lauf","7. Lauf","8. Lauf","9. Lauf","10. Lauf","11. Lauf","12. Lauf","13. Lauf","14. Lauf","15. Lauf","16. Lauf","17. Lauf","18. Lauf","19. Lauf","20. Lauf","(aus allen Läufen)",null,null,"Läufe\n",{"$f":"\"(mind. \"&Einstellungen!E4& IF(Einstellungen!E4=1,\" Lauf \",\" Läufe \")&\"\n\"&\"bei \"&Einstellungen!E5&IF(Einstellungen!E5=1,\" Streicher)\",\" Streichern)\")","v":"(mind. 1 Lauf \nbei 3 Streichern)"},null,null,null,"Anzahl","max. Anzahl der Wertungsläufe:",null,null,null,null,null,null,{"$f":"Einstellungen!E3-Einstellungen!E5","v":7},null,"erforderliche Wertungsläufe:",null,null,null,null,null,{"$f":"Einstellungen!E4","v":1},null,null,null,null,{"$f":"Einstellungen!E6","v":"unverändert"},"absteigendem\nRang aus","Punkte+","Punkten+","absteigendem\nRang aus"]
["Teilnehmer",{"$f":"Runden!B3","v":"2018-12-04"},{"$f":"Runden!C3","v":"2019-01-01"},{"$f":"Runden!D3","v":"2019-01-29"},{"$f":"Runden!E3","v":"2019-02-26"},{"$f":"Runden!F3","v":"2019-03-26"},{"$f":"Runden!G3","v":"2019-04-23"},{"$f":"Runden!H3","v":"2019-05-21"},{"$f":"Runden!I3","v":"2019-06-18"},{"$f":"Runden!J3","v":"2019-07-16"},{"$f":"Runden!K3","v":"2019-08-13"},{"$f":"Runden!L3","v":"2019-09-10"},{"$f":"Runden!M3","v":"2019-10-08"},{"$f":"Runden!N3","v":"2019-11-05"},{"$f":"Runden!O3","v":"2019-12-03"},{"$f":"Runden!P3","v":"2019-12-31"},{"$f":"Runden!Q3","v":"2020-01-28"},{"$f":"Runden!R3","v":"2020-02-25"},{"$f":"Runden!S3","v":"2020-03-24"},{"$f":"Runden!T3","v":"2020-04-21"},{"$f":"Runden!U3","v":"2020-05-19"},"Punkte","Platz","Runden","Anzahl","Punkte","Platz",null,null,"Wertungen",1,2,3,4,5,6,7,8,9,10,11,12,13,14,15,16,17,18,19,20,null,"G-Runden","Runden","Runden","\"bester Platz\""]
[{"$f":"IF(Runden!A10=\"\",\"\",Runden!A10)","v":"Ewald"},{"$f":"IF(Rang!B10>0,VLOOKUP(Rang!B10,Einstellungen!$A$3:$B$52,2,FALSE),0)","v":20},{"$f":"IF(Rang!C10>0,VLOOKUP(Rang!C10,Einstellungen!$A$3:$B$52,2,FALSE),0)","v":0},{"$f":"IF(Rang!D10>0,VLOOKUP(Rang!D10,Einstellungen!$A$3:$B$52,2,FALSE),0)","v":0},{"$f":"IF(Rang!E10>0,VLOOKUP(Rang!E10,Einstellungen!$A$3:$B$52,2,FALSE),0)","v":0},{"$f":"IF(Rang!F10>0,VLOOKUP(Rang!F10,Einstellungen!$A$3:$B$52,2,FALSE),0)","v":0},{"$f":"IF(Rang!G10>0,VLOOKUP(Rang!G10,Einstellungen!$A$3:$B$52,2,FALSE),0)","v":0},{"$f":"IF(Rang!H10>0,VLOOKUP(Rang!H10,Einstellungen!$A$3:$B$52,2,FALSE),0)","v":0},{"$f":"IF(Rang!I10>0,VLOOKUP(Rang!I10,Einstellungen!$A$3:$B$52,2,FALSE),0)","v":0},{"$f":"IF(Rang!J10>0,VLOOKUP(Rang!J10,Einstellungen!$A$3:$B$52,2,FALSE),0)","v":0},{"$f":"IF(Rang!K10>0,VLOOKUP(Rang!K10,Einstellungen!$A$3:$B$52,2,FALSE),0)","v":0},{"$f":"IF(Rang!L10>0,VLOOKUP(Rang!L10,Einstellungen!$A$3:$B$52,2,FALSE),0)","v":0},{"$f":"IF(Rang!M10>0,VLOOKUP(Rang!M10,Einstellungen!$A$3:$B$52,2,FALSE),0)","v":0},{"$f":"IF(Rang!N10>0,VLOOKUP(Rang!N10,Einstellungen!$A$3:$B$52,2,FALSE),0)","v":0},{"$f":"IF(Rang!O10>0,VLOOKUP(Rang!O10,Einstellungen!$A$3:$B$52,2,FALSE),0)","v":0},{"$f":"IF(Rang!P10>0,VLOOKUP(Rang!P10,Einstellungen!$A$3:$B$52,2,FALSE),0)","v":0},{"$f":"IF(Rang!Q10>0,VLOOKUP(Rang!Q10,Einstellungen!$A$3:$B$52,2,FALSE),0)","v":0},{"$f":"IF(Rang!R10>0,VLOOKUP(Rang!R10,Einstellungen!$A$3:$B$52,2,FALSE),0)","v":0},{"$f":"IF(Rang!S10>0,VLOOKUP(Rang!S10,Einstellungen!$A$3:$B$52,2,FALSE),0)","v":0},{"$f":"IF(Rang!T10>0,VLOOKUP(Rang!T10,Einstellungen!$A$3:$B$52,2,FALSE),0)","v":0},{"$f":"IF(Rang!U10>0,VLOOKUP(Rang!U10,Einstellungen!$A$3:$B$52,2,FALSE),0)","v":0},{"$f":"SUM(B4:U4)+IF($AY$4=2,AZ4,0)+IF($AY$4=3,BC4,0)","v":20},{"$f":"IF(SUM(B4:U4)>0,RANK(V4,$V$4:$V$53,0),0)","v":1},{"$f":"IF(SUM(B4:U4)>0,VLOOKUP(A4,TabRunden,22,FALSE),0)","v":143.05000000000001},{"$f":"AD4","v":1},{"$f":"IF(AD4>=$AT$2,LOOKUP($AL$2,$AE$3:$AX$3,AE4:AX4),0)+IF($AY$4=2,AZ4,0)+IF($AY$4=3,BC4,0)","v":20},{"$f":"IF(Z4>0,RANK(Z4,$Z$4:$Z$53,0),0)","v":1},{"$f":"IF(W4=0,51,W4)+IF(A4=\"\",50,0)","v":1},{"$f":"IF(AA4=0,51,AA4)+IF(A4=\"\",50,0)","v":1},{"$f":"20-COUNTIF(B4:U4,0)","v":1},{"$f":"LARGE($B4:$U4,AE$3)","v":20},{"$f":"LARGE($B4:$U4,AF$3)+AE4","v":20},20,20,20,20,20,20,20,20,20,20,20,20,20,20,20,20,20,20,{"$f":"IF(AY2=\"unverändert\",1,IF(AY2=\"Gesamtrunden\",2,IF(AY2= \"bester Platz\",3,0)))","v":1},{"$f":"IF(X4>0,RANK(X4,$X$4:$X$53,1),0)/1000","v":0.05},{"$f":"AX4+AZ4","v":20.05},{"$f":"IF(BA4>0,RANK(BA4,$BA$4:$BA$53,0),0)","v":1},{"$f":"IF(X4>0,VLOOKUP(A4,Rang!$A$4:$AU$53,47,FALSE))/1000","v":0.05}]
[{"$f":"IF(Runden!A9=\"\",\"\",Runden!A9)","v":"Chris"},{"$f":"IF(Rang!B9>0,VLOOKUP(Rang!B9,Einstellungen!$A$3:$B$52,2,FALSE),0)","v":18},{"$f":"IF(Rang!C9>0,VLOOKUP(Rang!C9,Einstellungen!$A$3:$B$52,2,FALSE),0)","v":0},{"$f":"IF(Rang!D9>0,VLOOKUP(Rang!D9,Einstellungen!$A$3:$B$52,2,FALSE),0)","v":0},{"$f":"IF(Rang!E9>0,VLOOKUP(Rang!E9,Einstellungen!$A$3:$B$52,2,FALSE),0)","v":0},{"$f":"IF(Rang!F9>0,VLOOKUP(Rang!F9,Einstellungen!$A$3:$B$52,2,FALSE),0)","v":0},{"$f":"IF(Rang!G9>0,VLOOKUP(Rang!G9,Einstellungen!$A$3:$B$52,2,FALSE),0)","v":0},{"$f":"IF(Rang!H9>0,VLOOKUP(Rang!H9,Einstellungen!$A$3:$B$52,2,FALSE),0)","v":0},{"$f":"IF(Rang!I9>0,VLOOKUP(Rang!I9,Einstellungen!$A$3:$B$52,2,FALSE),0)","v":0},{"$f":"IF(Rang!J9>0,VLOOKUP(Rang!J9,Einstellungen!$A$3:$B$52,2,FALSE),0)","v":0},{"$f":"IF(Rang!K9>0,VLOOKUP(Rang!K9,Einstellungen!$A$3:$B$52,2,FALSE),0)","v":0},{"$f":"IF(Rang!L9>0,VLOOKUP(Rang!L9,Einstellungen!$A$3:$B$52,2,FALSE),0)","v":0},{"$f":"IF(Rang!M9>0,VLOOKUP(Rang!M9,Einstellungen!$A$3:$B$52,2,FALSE),0)","v":0},{"$f":"IF(Rang!N9>0,VLOOKUP(Rang!N9,Einstellungen!$A$3:$B$52,2,FALSE),0)","v":0},{"$f":"IF(Rang!O9>0,VLOOKUP(Rang!O9,Einstellungen!$A$3:$B$52,2,FALSE),0)","v":0},{"$f":"IF(Rang!P9>0,VLOOKUP(Rang!P9,Einstellungen!$A$3:$B$52,2,FALSE),0)","v":0},{"$f":"IF(Rang!Q9>0,VLOOKUP(Rang!Q9,Einstellungen!$A$3:$B$52,2,FALSE),0)","v":0},{"$f":"IF(Rang!R9>0,VLOOKUP(Rang!R9,Einstellungen!$A$3:$B$52,2,FALSE),0)","v":0},{"$f":"IF(Rang!S9>0,VLOOKUP(Rang!S9,Einstellungen!$A$3:$B$52,2,FALSE),0)","v":0},{"$f":"IF(Rang!T9>0,VLOOKUP(Rang!T9,Einstellungen!$A$3:$B$52,2,FALSE),0)","v":0},{"$f":"IF(Rang!U9>0,VLOOKUP(Rang!U9,Einstellungen!$A$3:$B$52,2,FALSE),0)","v":0},{"$f":"SUM(B5:U5)+IF($AY$4=2,AZ5,0)+IF($AY$4=3,BC5,0)","v":18},{"$f":"IF(SUM(B5:U5)>0,RANK(V5,$V$4:$V$53,0),0)","v":2},{"$f":"IF(SUM(B5:U5)>0,VLOOKUP(A5,TabRunden,22,FALSE),0)","v":139.4},{"$f":"AD5","v":1},{"$f":"IF(AD5>=$AT$2,LOOKUP($AL$2,$AE$3:$AX$3,AE5:AX5),0)+IF($AY$4=2,AZ5,0)+IF($AY$4=3,BC5,0)","v":18},{"$f":"IF(Z5>0,RANK(Z5,$Z$4:$Z$53,0),0)","v":2},{"$f":"IF(W5=0,51,W5)+IF(A5=\"\",50,0)","v":2},{"$f":"IF(AA5=0,51,AA5)+IF(A5=\"\",50,0)","v":2},1,{"$f":"LARGE($B5:$U5,AE$3)","v":18},{"$f":"LARGE($B5:$U5,AF$3)+AE5","v":18},18,18,18,18,18,18,18,18,18,18,18,18,18,18,18,18,18,18,null,{"$f":"IF(X5>0,RANK(X5,$X$4:$X$53,1),0)/1000","v":4.9000000000000002E-2},{"$f":"AX5+AZ5","v":18.048999999999999},{"$f":"IF(BA5>0,RANK(BA5,$BA$4:$BA$53,0),0)","v":2},{"$f":"IF(X5>0,VLOOKUP(A5,Rang!$A$4:$AU$53,47,FALSE))/1000","v":4.9000000000000002E-2}]
[{"$f":"IF(Runden!A14=\"\",\"\",Runden!A14)","v":"Thomas V."},{"$f":"IF(Rang!B14>0,VLOOKUP(Rang!B14,Einstellungen!$A$3:$B$52,2,FALSE),0)","v":16},{"$f":"IF(Rang!C14>0,VLOOKUP(Rang!C14,Einstellungen!$A$3:$B$52,2,FALSE),0)","v":0},{"$f":"IF(Rang!D14>0,VLOOKUP(Rang!D14,Einstellungen!$A$3:$B$52,2,FALSE),0)","v":0},{"$f":"IF(Rang!E14>0,VLOOKUP(Rang!E14,Einstellungen!$A$3:$B$52,2,FALSE),0)","v":0},{"$f":"IF(Rang!F14>0,VLOOKUP(Rang!F14,Einstellungen!$A$3:$B$52,2,FALSE),0)","v":0},{"$f":"IF(Rang!G14>0,VLOOKUP(Rang!G14,Einstellungen!$A$3:$B$52,2,FALSE),0)","v":0},{"$f":"IF(Rang!H14>0,VLOOKUP(Rang!H14,Einstellungen!$A$3:$B$52,2,FALSE),0)","v":0},{"$f":"IF(Rang!I14>0,VLOOKUP(Rang!I14,Einstellungen!$A$3:$B$52,2,FALSE),0)","v":0},{"$f":"IF(Rang!J14>0,VLOOKUP(Rang!J14,Einstellungen!$A$3:$B$52,2,FALSE),0)","v":0},{"$f":"IF(Rang!K14>0,VLOOKUP(Rang!K14,Einstellungen!$A$3:$B$52,2,FALSE),0)","v":0},{"$f":"IF(Rang!L14>0,VLOOKUP(Rang!L14,Einstellungen!$A$3:$B$52,2,FALSE),0)","v":0},{"$f":"IF(Rang!M14>0,VLOOKUP(Rang!M14,Einstellungen!$A$3:$B$52,2,FALSE),0)","v":0},{"$f":"IF(Rang!N14>0,VLOOKUP(Rang!N14,Einstellungen!$A$3:$B$52,2,FALSE),0)","v":0},{"$f":"IF(Rang!O14>0,VLOOKUP(Rang!O14,Einstellungen!$A$3:$B$52,2,FALSE),0)","v":0},{"$f":"IF(Rang!P14>0,VLOOKUP(Rang!P14,Einstellungen!$A$3:$B$52,2,FALSE),0)","v":0},{"$f":"IF(Rang!Q14>0,VLOOKUP(Rang!Q14,Einstellungen!$A$3:$B$52,2,FALSE),0)","v":0},{"$f":"IF(Rang!R14>0,VLOOKUP(Rang!R14,Einstellungen!$A$3:$B$52,2,FALSE),0)","v":0},{"$f":"IF(Rang!S14>0,VLOOKUP(Rang!S14,Einstellungen!$A$3:$B$52,2,FALSE),0)","v":0},{"$f":"IF(Rang!T14>0,VLOOKUP(Rang!T14,Einstellungen!$A$3:$B$52,2,FALSE),0)","v":0},{"$f":"IF(Rang!U14>0,VLOOKUP(Rang!U14,Einstellungen!$A$3:$B$52,2,FALSE),0)","v":0},{"$f":"SUM(B6:U6)+IF($AY$4=2,AZ6,0)+IF($AY$4=3,BC6,0)","v":16},{"$f":"IF(SUM(B6:U6)>0,RANK(V6,$V$4:$V$53,0),0)","v":3},{"$f":"IF(SUM(B6:U6)>0,VLOOKUP(A6,TabRunden,22,FALSE),0)","v":138.22},{"$f":"AD6","v":1},{"$f":"IF(AD6>=$AT$2,LOOKUP($AL$2,$AE$3:$AX$3,AE6:AX6),0)+IF($AY$4=2,AZ6,0)+IF($AY$4=3,BC6,0)","v":16},{"$f":"IF(Z6>0,RANK(Z6,$Z$4:$Z$53,0),0)","v":3},{"$f":"IF(W6=0,51,W6)+IF(A6=\"\",50,0)","v":3},{"$f":"IF(AA6=0,51,AA6)+IF(A6=\"\",50,0)","v":3},1,16,{"$f":"LARGE($B6:$U6,AF$3)+AE6","v":16},16,16,16,16,16,16,16,16,16,16,16,16,16,16,16,16,16,16,null,4.8000000000000001E-2,{"$f":"AX6+AZ6","v":16.047999999999998},3,{"$f":"IF(X6>0,VLOOKUP(A6,Rang!$A$4:$AU$53,47,FALSE))/1000","v":4.8000000000000001E-2}]
[{"$f":"IF(Runden!A8=\"\",\"\",Runden!A8)","v":"Hans"},{"$f":"IF(Rang!B8>0,VLOOKUP(Rang!B8,Einstellungen!$A$3:$B$52,2,FALSE),0)","v":15},{"$f":"IF(Rang!C8>0,VLOOKUP(Rang!C8,Einstellungen!$A$3:$B$52,2,FALSE),0)","v":0},{"$f":"IF(Rang!D8>0,VLOOKUP(Rang!D8,Einstellungen!$A$3:$B$52,2,FALSE),0)","v":0},{"$f":"IF(Rang!E8>0,VLOOKUP(Rang!E8,Einstellungen!$A$3:$B$52,2,FALSE),0)","v":0},{"$f":"IF(Rang!F8>0,VLOOKUP(Rang!F8,Einstellungen!$A$3:$B$52,2,FALSE),0)","v":0},{"$f":"IF(Rang!G8>0,VLOOKUP(Rang!G8,Einstellungen!$A$3:$B$52,2,FALSE),0)","v":0},{"$f":"IF(Rang!H8>0,VLOOKUP(Rang!H8,Einstellungen!$A$3:$B$52,2,FALSE),0)","v":0},{"$f":"IF(Rang!I8>0,VLOOKUP(Rang!I8,Einstellungen!$A$3:$B$52,2,FALSE),0)","v":0},{"$f":"IF(Rang!J8>0,VLOOKUP(Rang!J8,Einstellungen!$A$3:$B$52,2,FALSE),0)","v":0},{"$f":"IF(Rang!K8>0,VLOOKUP(Rang!K8,Einstellungen!$A$3:$B$52,2,FALSE),0)","v":0},{"$f":"IF(Rang!L8>0,VLOOKUP(Rang!L8,Einstellungen!$A$3:$B$52,2,FALSE),0)","v":0},{"$f":"IF(Rang!M8>0,VLOOKUP(Rang!M8,Einstellungen!$A$3:$B$52,2,FALSE),0)","v":0},{"$f":"IF(Rang!N8>0,VLOOKUP(Rang!N8,Einstellungen!$A$3:$B$52,2,FALSE),0)","v":0},{"$f":"IF(Rang!O8>0,VLOOKUP(Rang!O8,Einstellungen!$A$3:$B$52,2,FALSE),0)","v":0},{"$f":"IF(Rang!P8>0,VLOOKUP(Rang!P8,Einstellungen!$A$3:$B$52,2,FALSE),0)","v":0},{"$f":"IF(Rang!Q8>0,VLOOKUP(Rang!Q8,Einstellungen!$A$3:$B$52,2,FALSE),0)","v":0},{"$f":"IF(Rang!R8>0,VLOOKUP(Rang!R8,Einstellungen!$A$3:$B$52,2,FALSE),0)","v":0},{"$f":"IF(Rang!S8>0,VLOOKUP(Rang!S8,Einstellungen!$A$3:$B$52,2,FALSE),0)","v":0},{"$f":"IF(Rang!T8>0,VLOOKUP(Rang!T8,Einstellungen!$A$3:$B$52,2,FALSE),0)","v":0},{"$f":"IF(Rang!U8>0,VLOOKUP(Rang!U8,Einstellungen!$A$3:$B$52,2,FALSE),0)","v":0},{"$f":"SUM(B7:U7)+IF($AY$4=2,AZ7,0)+IF($AY$4=3,BC7,0)","v":15},{"$f":"IF(SUM(B7:U7)>0,RANK(V7,$V$4:$V$53,0),0)","v":4},{"$f":"IF(SUM(B7:U7)>0,VLOOKUP(A7,TabRunden,22,FALSE),0)","v":137.30000000000001},{"$f":"AD7","v":1},{"$f":"IF(AD7>=$AT$2,LOOKUP($AL$2,$AE$3:$AX$3,AE7:AX7),0)+IF($AY$4=2,AZ7,0)+IF($AY$4=3,BC7,0)","v":15},{"$f":"IF(Z7>0,RANK(Z7,$Z$4:$Z$53,0),0)","v":4},{"$f":"IF(W7=0,51,W7)+IF(A7=\"\",50,0)","v":4},{"$f":"IF(AA7=0,51,AA7)+IF(A7=\"\",50,0)","v":4},1,15,{"$f":"LARGE($B7:$U7,AF$3)+AE7","v":15},15,15,15,15,15,15,15,15,15,15,15,15,15,15,15,15,15,15,null,4.7E-2,15.047000000000001,4,{"$f":"IF(X7>0,VLOOKUP(A7,Rang!$A$4:$AU$53,47,FALSE))/1000","v":4.7E-2}]
[{"$f":"IF(Runden!A5=\"\",\"\",Runden!A5)","v":"Günter"},{"$f":"IF(Rang!B5>0,VLOOKUP(Rang!B5,Einstellungen!$A$3:$B$52,2,FALSE),0)","v":14},{"$f":"IF(Rang!C5>0,VLOOKUP(Rang!C5,Einstellungen!$A$3:$B$52,2,FALSE),0)","v":0},{"$f":"IF(Rang!D5>0,VLOOKUP(Rang!D5,Einstellungen!$A$3:$B$52,2,FALSE),0)","v":0},{"$f":"IF(Rang!E5>0,VLOOKUP(Rang!E5,Einstellungen!$A$3:$B$52,2,FALSE),0)","v":0},{"$f":"IF(Rang!F5>0,VLOOKUP(Rang!F5,Einstellungen!$A$3:$B$52,2,FALSE),0)","v":0},{"$f":"IF(Rang!G5>0,VLOOKUP(Rang!G5,Einstellungen!$A$3:$B$52,2,FALSE),0)","v":0},{"$f":"IF(Rang!H5>0,VLOOKUP(Rang!H5,Einstellungen!$A$3:$B$52,2,FALSE),0)","v":0},{"$f":"IF(Rang!I5>0,VLOOKUP(Rang!I5,Einstellungen!$A$3:$B$52,2,FALSE),0)","v":0},{"$f":"IF(Rang!J5>0,VLOOKUP(Rang!J5,Einstellungen!$A$3:$B$52,2,FALSE),0)","v":0},{"$f":"IF(Rang!K5>0,VLOOKUP(Rang!K5,Einstellungen!$A$3:$B$52,2,FALSE),0)","v":0},{"$f":"IF(Rang!L5>0,VLOOKUP(Rang!L5,Einstellungen!$A$3:$B$52,2,FALSE),0)","v":0},{"$f":"IF(Rang!M5>0,VLOOKUP(Rang!M5,Einstellungen!$A$3:$B$52,2,FALSE),0)","v":0},{"$f":"IF(Rang!N5>0,VLOOKUP(Rang!N5,Einstellungen!$A$3:$B$52,2,FALSE),0)","v":0},{"$f":"IF(Rang!O5>0,VLOOKUP(Rang!O5,Einstellungen!$A$3:$B$52,2,FALSE),0)","v":0},{"$f":"IF(Rang!P5>0,VLOOKUP(Rang!P5,Einstellungen!$A$3:$B$52,2,FALSE),0)","v":0},{"$f":"IF(Rang!Q5>0,VLOOKUP(Rang!Q5,Einstellungen!$A$3:$B$52,2,FALSE),0)","v":0},{"$f":"IF(Rang!R5>0,VLOOKUP(Rang!R5,Einstellungen!$A$3:$B$52,2,FALSE),0)","v":0},{"$f":"IF(Rang!S5>0,VLOOKUP(Rang!S5,Einstellungen!$A$3:$B$52,2,FALSE),0)","v":0},{"$f":"IF(Rang!T5>0,VLOOKUP(Rang!T5,Einstellungen!$A$3:$B$52,2,FALSE),0)","v":0},{"$f":"IF(Rang!U5>0,VLOOKUP(Rang!U5,Einstellungen!$A$3:$B$52,2,FALSE),0)","v":0},{"$f":"SUM(B8:U8)+IF($AY$4=2,AZ8,0)+IF($AY$4=3,BC8,0)","v":14},{"$f":"IF(SUM(B8:U8)>0,RANK(V8,$V$4:$V$53,0),0)","v":5},{"$f":"IF(SUM(B8:U8)>0,VLOOKUP(A8,TabRunden,22,FALSE),0)","v":136.03},{"$f":"AD8","v":1},{"$f":"IF(AD8>=$AT$2,LOOKUP($AL$2,$AE$3:$AX$3,AE8:AX8),0)+IF($AY$4=2,AZ8,0)+IF($AY$4=3,BC8,0)","v":14},{"$f":"IF(Z8>0,RANK(Z8,$Z$4:$Z$53,0),0)","v":5},{"$f":"IF(W8=0,51,W8)+IF(A8=\"\",50,0)","v":5},{"$f":"IF(AA8=0,51,AA8)+IF(A8=\"\",50,0)","v":5},1,14,{"$f":"LARGE($B8:$U8,AF$3)+AE8","v":14},14,14,14,14,14,14,14,14,14,14,14,14,14,14,14,14,14,14,null,4.5999999999999999E-2,14.045999999999999,5,{"$f":"IF(X8>0,VLOOKUP(A8,Rang!$A$4:$AU$53,47,FALSE))/1000","v":4.5999999999999999E-2}]
[{"$f":"IF(Runden!A6=\"\",\"\",Runden!A6)","v":"Marcus"},{"$f":"IF(Rang!B6>0,VLOOKUP(Rang!B6,Einstellungen!$A$3:$B$52,2,FALSE),0)","v":13},{"$f":"IF(Rang!C6>0,VLOOKUP(Rang!C6,Einstellungen!$A$3:$B$52,2,FALSE),0)","v":0},{"$f":"IF(Rang!D6>0,VLOOKUP(Rang!D6,Einstellungen!$A$3:$B$52,2,FALSE),0)","v":0},{"$f":"IF(Rang!E6>0,VLOOKUP(Rang!E6,Einstellungen!$A$3:$B$52,2,FALSE),0)","v":0},{"$f":"IF(Rang!F6>0,VLOOKUP(Rang!F6,Einstellungen!$A$3:$B$52,2,FALSE),0)","v":0},{"$f":"IF(Rang!G6>0,VLOOKUP(Rang!G6,Einstellungen!$A$3:$B$52,2,FALSE),0)","v":0},{"$f":"IF(Rang!H6>0,VLOOKUP(Rang!H6,Einstellungen!$A$3:$B$52,2,FALSE),0)","v":0},{"$f":"IF(Rang!I6>0,VLOOKUP(Rang!I6,Einstellungen!$A$3:$B$52,2,FALSE),0)","v":0},{"$f":"IF(Rang!J6>0,VLOOKUP(Rang!J6,Einstellungen!$A$3:$B$52,2,FALSE),0)","v":0},{"$f":"IF(Rang!K6>0,VLOOKUP(Rang!K6,Einstellungen!$A$3:$B$52,2,FALSE),0)","v":0},{"$f":"IF(Rang!L6>0,VLOOKUP(Rang!L6,Einstellungen!$A$3:$B$52,2,FALSE),0)","v":0},{"$f":"IF(Rang!M6>0,VLOOKUP(Rang!M6,Einstellungen!$A$3:$B$52,2,FALSE),0)","v":0},{"$f":"IF(Rang!N6>0,VLOOKUP(Rang!N6,Einstellungen!$A$3:$B$52,2,FALSE),0)","v":0},{"$f":"IF(Rang!O6>0,VLOOKUP(Rang!O6,Einstellungen!$A$3:$B$52,2,FALSE),0)","v":0},{"$f":"IF(Rang!P6>0,VLOOKUP(Rang!P6,Einstellungen!$A$3:$B$52,2,FALSE),0)","v":0},{"$f":"IF(Rang!Q6>0,VLOOKUP(Rang!Q6,Einstellungen!$A$3:$B$52,2,FALSE),0)","v":0},{"$f":"IF(Rang!R6>0,VLOOKUP(Rang!R6,Einstellungen!$A$3:$B$52,2,FALSE),0)","v":0},{"$f":"IF(Rang!S6>0,VLOOKUP(Rang!S6,Einstellungen!$A$3:$B$52,2,FALSE),0)","v":0},{"$f":"IF(Rang!T6>0,VLOOKUP(Rang!T6,Einstellungen!$A$3:$B$52,2,FALSE),0)","v":0},{"$f":"IF(Rang!U6>0,VLOOKUP(Rang!U6,Einstellungen!$A$3:$B$52,2,FALSE),0)","v":0},{"$f":"SUM(B9:U9)+IF($AY$4=2,AZ9,0)+IF($AY$4=3,BC9,0)","v":13},{"$f":"IF(SUM(B9:U9)>0,RANK(V9,$V$4:$V$53,0),0)","v":6},{"$f":"IF(SUM(B9:U9)>0,VLOOKUP(A9,TabRunden,22,FALSE),0)","v":135.38999999999999},{"$f":"AD9","v":1},{"$f":"IF(AD9>=$AT$2,LOOKUP($AL$2,$AE$3:$AX$3,AE9:AX9),0)+IF($AY$4=2,AZ9,0)+IF($AY$4=3,BC9,0)","v":13},{"$f":"IF(Z9>0,RANK(Z9,$Z$4:$Z$53,0),0)","v":6},{"$f":"IF(W9=0,51,W9)+IF(A9=\"\",50,0)","v":6},{"$f":"IF(AA9=0,51,AA9)+IF(A9=\"\",50,0)","v":6},1,13,{"$f":"LARGE($B9:$U9,AF$3)+AE9","v":13},13,13,13,13,13,13,13,13,13,13,13,13,13,13,13,13,13,13,null,4.4999999999999998E-2,13.045,6,{"$f":"IF(X9>0,VLOOKUP(A9,Rang!$A$4:$AU$53,47,FALSE))/1000","v":4.4999999999999998E-2}]
[{"$f":"IF(Runden!A4=\"\",\"\",Runden!A4)","v":"Ronald"},{"$f":"IF(Rang!B4>0,VLOOKUP(Rang!B4,Einstellungen!$A$3:$B$52,2,FALSE),0)","v":12},{"$f":"IF(Rang!C4>0,VLOOKUP(Rang!C4,Einstellungen!$A$3:$B$52,2,FALSE),0)","v":0},{"$f":"IF(Rang!D4>0,VLOOKUP(Rang!D4,Einstellungen!$A$3:$B$52,2,FALSE),0)","v":0},{"$f":"IF(Rang!E4>0,VLOOKUP(Rang!E4,Einstellungen!$A$3:$B$52,2,FALSE),0)","v":0},{"$f":"IF(Rang!F4>0,VLOOKUP(Rang!F4,Einstellungen!$A$3:$B$52,2,FALSE),0)","v":0},{"$f":"IF(Rang!G4>0,VLOOKUP(Rang!G4,Einstellungen!$A$3:$B$52,2,FALSE),0)","v":0},{"$f":"IF(Rang!H4>0,VLOOKUP(Rang!H4,Einstellungen!$A$3:$B$52,2,FALSE),0)","v":0},{"$f":"IF(Rang!I4>0,VLOOKUP(Rang!I4,Einstellungen!$A$3:$B$52,2,FALSE),0)","v":0},{"$f":"IF(Rang!J4>0,VLOOKUP(Rang!J4,Einstellungen!$A$3:$B$52,2,FALSE),0)","v":0},{"$f":"IF(Rang!K4>0,VLOOKUP(Rang!K4,Einstellungen!$A$3:$B$52,2,FALSE),0)","v":0},{"$f":"IF(Rang!L4>0,VLOOKUP(Rang!L4,Einstellungen!$A$3:$B$52,2,FALSE),0)","v":0},{"$f":"IF(Rang!M4>0,VLOOKUP(Rang!M4,Einstellungen!$A$3:$B$52,2,FALSE),0)","v":0},{"$f":"IF(Rang!N4>0,VLOOKUP(Rang!N4,Einstellungen!$A$3:$B$52,2,FALSE),0)","v":0},{"$f":"IF(Rang!O4>0,VLOOKUP(Rang!O4,Einstellungen!$A$3:$B$52,2,FALSE),0)","v":0},{"$f":"IF(Rang!P4>0,VLOOKUP(Rang!P4,Einstellungen!$A$3:$B$52,2,FALSE),0)","v":0},{"$f":"IF(Rang!Q4>0,VLOOKUP(Rang!Q4,Einstellungen!$A$3:$B$52,2,FALSE),0)","v":0},{"$f":"IF(Rang!R4>0,VLOOKUP(Rang!R4,Einstellungen!$A$3:$B$52,2,FALSE),0)","v":0},{"$f":"IF(Rang!S4>0,VLOOKUP(Rang!S4,Einstellungen!$A$3:$B$52,2,FALSE),0)","v":0},{"$f":"IF(Rang!T4>0,VLOOKUP(Rang!T4,Einstellungen!$A$3:$B$52,2,FALSE),0)","v":0},{"$f":"IF(Rang!U4>0,VLOOKUP(Rang!U4,Einstellungen!$A$3:$B$52,2,FALSE),0)","v":0},{"$f":"SUM(B10:U10)+IF($AY$4=2,AZ10,0)+IF($AY$4=3,BC10,0)","v":12},{"$f":"IF(SUM(B10:U10)>0,RANK(V10,$V$4:$V$53,0),0)","v":7},{"$f":"IF(SUM(B10:U10)>0,VLOOKUP(A10,TabRunden,22,FALSE),0)","v":134.65},{"$f":"AD10","v":1},{"$f":"IF(AD10>=$AT$2,LOOKUP($AL$2,$AE$3:$AX$3,AE10:AX10),0)+IF($AY$4=2,AZ10,0)+IF($AY$4=3,BC10,0)","v":12},{"$f":"IF(Z10>0,RANK(Z10,$Z$4:$Z$53,0),0)","v":7},{"$f":"IF(W10=0,51,W10)+IF(A10=\"\",50,0)","v":7},{"$f":"IF(AA10=0,51,AA10)+IF(A10=\"\",50,0)","v":7},1,12,{"$f":"LARGE($B10:$U10,AF$3)+AE10","v":12},12,12,12,12,12,12,12,12,12,12,12,12,12,12,12,12,12,12,null,4.3999999999999997E-2,12.044,7,{"$f":"IF(X10>0,VLOOKUP(A10,Rang!$A$4:$AU$53,47,FALSE))/1000","v":4.3999999999999997E-2}]
[{"$f":"IF(Runden!A15=\"\",\"\",Runden!A15)","v":"Christoph"},{"$f":"IF(Rang!B15>0,VLOOKUP(Rang!B15,Einstellungen!$A$3:$B$52,2,FALSE),0)","v":11},{"$f":"IF(Rang!C15>0,VLOOKUP(Rang!C15,Einstellungen!$A$3:$B$52,2,FALSE),0)","v":0},{"$f":"IF(Rang!D15>0,VLOOKUP(Rang!D15,Einstellungen!$A$3:$B$52,2,FALSE),0)","v":0},{"$f":"IF(Rang!E15>0,VLOOKUP(Rang!E15,Einstellungen!$A$3:$B$52,2,FALSE),0)","v":0},{"$f":"IF(Rang!F15>0,VLOOKUP(Rang!F15,Einstellungen!$A$3:$B$52,2,FALSE),0)","v":0},{"$f":"IF(Rang!G15>0,VLOOKUP(Rang!G15,Einstellungen!$A$3:$B$52,2,FALSE),0)","v":0},{"$f":"IF(Rang!H15>0,VLOOKUP(Rang!H15,Einstellungen!$A$3:$B$52,2,FALSE),0)","v":0},{"$f":"IF(Rang!I15>0,VLOOKUP(Rang!I15,Einstellungen!$A$3:$B$52,2,FALSE),0)","v":0},{"$f":"IF(Rang!J15>0,VLOOKUP(Rang!J15,Einstellungen!$A$3:$B$52,2,FALSE),0)","v":0},{"$f":"IF(Rang!K15>0,VLOOKUP(Rang!K15,Einstellungen!$A$3:$B$52,2,FALSE),0)","v":0},{"$f":"IF(Rang!L15>0,VLOOKUP(Rang!L15,Einstellungen!$A$3:$B$52,2,FALSE),0)","v":0},{"$f":"IF(Rang!M15>0,VLOOKUP(Rang!M15,Einstellungen!$A$3:$B$52,2,FALSE),0)","v":0},{"$f":"IF(Rang!N15>0,VLOOKUP(Rang!N15,Einstellungen!$A$3:$B$52,2,FALSE),0)","v":0},{"$f":"IF(Rang!O15>0,VLOOKUP(Rang!O15,Einstellungen!$A$3:$B$52,2,FALSE),0)","v":0},{"$f":"IF(Rang!P15>0,VLOOKUP(Rang!P15,Einstellungen!$A$3:$B$52,2,FALSE),0)","v":0},{"$f":"IF(Rang!Q15>0,VLOOKUP(Rang!Q15,Einstellungen!$A$3:$B$52,2,FALSE),0)","v":0},{"$f":"IF(Rang!R15>0,VLOOKUP(Rang!R15,Einstellungen!$A$3:$B$52,2,FALSE),0)","v":0},{"$f":"IF(Rang!S15>0,VLOOKUP(Rang!S15,Einstellungen!$A$3:$B$52,2,FALSE),0)","v":0},{"$f":"IF(Rang!T15>0,VLOOKUP(Rang!T15,Einstellungen!$A$3:$B$52,2,FALSE),0)","v":0},{"$f":"IF(Rang!U15>0,VLOOKUP(Rang!U15,Einstellungen!$A$3:$B$52,2,FALSE),0)","v":0},{"$f":"SUM(B11:U11)+IF($AY$4=2,AZ11,0)+IF($AY$4=3,BC11,0)","v":11},{"$f":"IF(SUM(B11:U11)>0,RANK(V11,$V$4:$V$53,0),0)","v":8},{"$f":"IF(SUM(B11:U11)>0,VLOOKUP(A11,TabRunden,22,FALSE),0)","v":124.57},{"$f":"AD11","v":1},{"$f":"IF(AD11>=$AT$2,LOOKUP($AL$2,$AE$3:$AX$3,AE11:AX11),0)+IF($AY$4=2,AZ11,0)+IF($AY$4=3,BC11,0)","v":11},{"$f":"IF(Z11>0,RANK(Z11,$Z$4:$Z$53,0),0)","v":8},{"$f":"IF(W11=0,51,W11)+IF(A11=\"\",50,0)","v":8},{"$f":"IF(AA11=0,51,AA11)+IF(A11=\"\",50,0)","v":8},1,11,{"$f":"LARGE($B11:$U11,AF$3)+AE11","v":11},11,11,11,11,11,11,11,11,11,11,11,11,11,11,11,11,11,11,null,4.2999999999999997E-2,11.042999999999999,8,{"$f":"IF(X11>0,VLOOKUP(A11,Rang!$A$4:$AU$53,47,FALSE))/1000","v":4.2999999999999997E-2}]
[{"$f":"IF(Runden!A13=\"\",\"\",Runden!A13)","v":"Thomas S."},{"$f":"IF(Rang!B13>0,VLOOKUP(Rang!B13,Einstellungen!$A$3:$B$52,2,FALSE),0)","v":10},{"$f":"IF(Rang!C13>0,VLOOKUP(Rang!C13,Einstellungen!$A$3:$B$52,2,FALSE),0)","v":0},{"$f":"IF(Rang!D13>0,VLOOKUP(Rang!D13,Einstellungen!$A$3:$B$52,2,FALSE),0)","v":0},{"$f":"IF(Rang!E13>0,VLOOKUP(Rang!E13,Einstellungen!$A$3:$B$52,2,FALSE),0)","v":0},{"$f":"IF(Rang!F13>0,VLOOKUP(Rang!F13,Einstellungen!$A$3:$B$52,2,FALSE),0)","v":0},{"$f":"IF(Rang!G13>0,VLOOKUP(Rang!G13,Einstellungen!$A$3:$B$52,2,FALSE),0)","v":0},{"$f":"IF(Rang!H13>0,VLOOKUP(Rang!H13,Einstellungen!$A$3:$B$52,2,FALSE),0)","v":0},{"$f":"IF(Rang!I13>0,VLOOKUP(Rang!I13,Einstellungen!$A$3:$B$52,2,FALSE),0)","v":0},{"$f":"IF(Rang!J13>0,VLOOKUP(Rang!J13,Einstellungen!$A$3:$B$52,2,FALSE),0)","v":0},{"$f":"IF(Rang!K13>0,VLOOKUP(Rang!K13,Einstellungen!$A$3:$B$52,2,FALSE),0)","v":0},{"$f":"IF(Rang!L13>0,VLOOKUP(Rang!L13,Einstellungen!$A$3:$B$52,2,FALSE),0)","v":0},{"$f":"IF(Rang!M13>0,VLOOKUP(Rang!M13,Einstellungen!$A$3:$B$52,2,FALSE),0)","v":0},{"$f":"IF(Rang!N13>0,VLOOKUP(Rang!N13,Einstellungen!$A$3:$B$52,2,FALSE),0)","v":0},{"$f":"IF(Rang!O13>0,VLOOKUP(Rang!O13,Einstellungen!$A$3:$B$52,2,FALSE),0)","v":0},{"$f":"IF(Rang!P13>0,VLOOKUP(Rang!P13,Einstellungen!$A$3:$B$52,2,FALSE),0)","v":0},{"$f":"IF(Rang!Q13>0,VLOOKUP(Rang!Q13,Einstellungen!$A$3:$B$52,2,FALSE),0)","v":0},{"$f":"IF(Rang!R13>0,VLOOKUP(Rang!R13,Einstellungen!$A$3:$B$52,2,FALSE),0)","v":0},{"$f":"IF(Rang!S13>0,VLOOKUP(Rang!S13,Einstellungen!$A$3:$B$52,2,FALSE),0)","v":0},{"$f":"IF(Rang!T13>0,VLOOKUP(Rang!T13,Einstellungen!$A$3:$B$52,2,FALSE),0)","v":0},{"$f":"IF(Rang!U13>0,VLOOKUP(Rang!U13,Einstellungen!$A$3:$B$52,2,FALSE),0)","v":0},{"$f":"SUM(B12:U12)+IF($AY$4=2,AZ12,0)+IF($AY$4=3,BC12,0)","v":10},{"$f":"IF(SUM(B12:U12)>0,RANK(V12,$V$4:$V$53,0),0)","v":9},{"$f":"IF(SUM(B12:U12)>0,VLOOKUP(A12,TabRunden,22,FALSE),0)","v":120.57},{"$f":"AD12","v":1},{"$f":"IF(AD12>=$AT$2,LOOKUP($AL$2,$AE$3:$AX$3,AE12:AX12),0)+IF($AY$4=2,AZ12,0)+IF($AY$4=3,BC12,0)","v":10},{"$f":"IF(Z12>0,RANK(Z12,$Z$4:$Z$53,0),0)","v":9},{"$f":"IF(W12=0,51,W12)+IF(A12=\"\",50,0)","v":9},{"$f":"IF(AA12=0,51,AA12)+IF(A12=\"\",50,0)","v":9},1,10,{"$f":"LARGE($B12:$U12,AF$3)+AE12","v":10},10,10,10,10,10,10,10,10,10,10,10,10,10,10,10,10,10,10,null,4.2000000000000003E-2,10.042,9,{"$f":"IF(X12>0,VLOOKUP(A12,Rang!$A$4:$AU$53,47,FALSE))/1000","v":4.2000000000000003E-2}]
[{"$f":"IF(Runden!A12=\"\",\"\",Runden!A12)","v":"Thomas G."},{"$f":"IF(Rang!B12>0,VLOOKUP(Rang!B12,Einstellungen!$A$3:$B$52,2,FALSE),0)","v":9},{"$f":"IF(Rang!C12>0,VLOOKUP(Rang!C12,Einstellungen!$A$3:$B$52,2,FALSE),0)","v":0},{"$f":"IF(Rang!D12>0,VLOOKUP(Rang!D12,Einstellungen!$A$3:$B$52,2,FALSE),0)","v":0},{"$f":"IF(Rang!E12>0,VLOOKUP(Rang!E12,Einstellungen!$A$3:$B$52,2,FALSE),0)","v":0},{"$f":"IF(Rang!F12>0,VLOOKUP(Rang!F12,Einstellungen!$A$3:$B$52,2,FALSE),0)","v":0},{"$f":"IF(Rang!G12>0,VLOOKUP(Rang!G12,Einstellungen!$A$3:$B$52,2,FALSE),0)","v":0},{"$f":"IF(Rang!H12>0,VLOOKUP(Rang!H12,Einstellungen!$A$3:$B$52,2,FALSE),0)","v":0},{"$f":"IF(Rang!I12>0,VLOOKUP(Rang!I12,Einstellungen!$A$3:$B$52,2,FALSE),0)","v":0},{"$f":"IF(Rang!J12>0,VLOOKUP(Rang!J12,Einstellungen!$A$3:$B$52,2,FALSE),0)","v":0},{"$f":"IF(Rang!K12>0,VLOOKUP(Rang!K12,Einstellungen!$A$3:$B$52,2,FALSE),0)","v":0},{"$f":"IF(Rang!L12>0,VLOOKUP(Rang!L12,Einstellungen!$A$3:$B$52,2,FALSE),0)","v":0},{"$f":"IF(Rang!M12>0,VLOOKUP(Rang!M12,Einstellungen!$A$3:$B$52,2,FALSE),0)","v":0},{"$f":"IF(Rang!N12>0,VLOOKUP(Rang!N12,Einstellungen!$A$3:$B$52,2,FALSE),0)","v":0},{"$f":"IF(Rang!O12>0,VLOOKUP(Rang!O12,Einstellungen!$A$3:$B$52,2,FALSE),0)","v":0},{"$f":"IF(Rang!P12>0,VLOOKUP(Rang!P12,Einstellungen!$A$3:$B$52,2,FALSE),0)","v":0},{"$f":"IF(Rang!Q12>0,VLOOKUP(Rang!Q12,Einstellungen!$A$3:$B$52,2,FALSE),0)","v":0},{"$f":"IF(Rang!R12>0,VLOOKUP(Rang!R12,Einstellungen!$A$3:$B$52,2,FALSE),0)","v":0},{"$f":"IF(Rang!S12>0,VLOOKUP(Rang!S12,Einstellungen!$A$3:$B$52,2,FALSE),0)","v":0},{"$f":"IF(Rang!T12>0,VLOOKUP(Rang!T12,Einstellungen!$A$3:$B$52,2,FALSE),0)","v":0},{"$f":"IF(Rang!U12>0,VLOOKUP(Rang!U12,Einstellungen!$A$3:$B$52,2,FALSE),0)","v":0},{"$f":"SUM(B13:U13)+IF($AY$4=2,AZ13,0)+IF($AY$4=3,BC13,0)","v":9},{"$f":"IF(SUM(B13:U13)>0,RANK(V13,$V$4:$V$53,0),0)","v":10},{"$f":"IF(SUM(B13:U13)>0,VLOOKUP(A13,TabRunden,22,FALSE),0)","v":117.71},{"$f":"AD13","v":1},{"$f":"IF(AD13>=$AT$2,LOOKUP($AL$2,$AE$3:$AX$3,AE13:AX13),0)+IF($AY$4=2,AZ13,0)+IF($AY$4=3,BC13,0)","v":9},{"$f":"IF(Z13>0,RANK(Z13,$Z$4:$Z$53,0),0)","v":10},{"$f":"IF(W13=0,51,W13)+IF(A13=\"\",50,0)","v":10},{"$f":"IF(AA13=0,51,AA13)+IF(A13=\"\",50,0)","v":10},1,9,{"$f":"LARGE($B13:$U13,AF$3)+AE13","v":9},9,9,9,9,9,9,9,9,9,9,9,9,9,9,9,9,9,9,null,4.1000000000000002E-2,9.0410000000000004,10,{"$f":"IF(X13>0,VLOOKUP(A13,Rang!$A$4:$AU$53,47,FALSE))/1000","v":4.1000000000000002E-2}]
[{"$f":"IF(Runden!A7=\"\",\"\",Runden!A7)","v":"Dietmar"},{"$f":"IF(Rang!B7>0,VLOOKUP(Rang!B7,Einstellungen!$A$3:$B$52,2,FALSE),0)","v":0},{"$f":"IF(Rang!C7>0,VLOOKUP(Rang!C7,Einstellungen!$A$3:$B$52,2,FALSE),0)","v":0},{"$f":"IF(Rang!D7>0,VLOOKUP(Rang!D7,Einstellungen!$A$3:$B$52,2,FALSE),0)","v":0},{"$f":"IF(Rang!E7>0,VLOOKUP(Rang!E7,Einstellungen!$A$3:$B$52,2,FALSE),0)","v":0},{"$f":"IF(Rang!F7>0,VLOOKUP(Rang!F7,Einstellungen!$A$3:$B$52,2,FALSE),0)","v":0},{"$f":"IF(Rang!G7>0,VLOOKUP(Rang!G7,Einstellungen!$A$3:$B$52,2,FALSE),0)","v":0},{"$f":"IF(Rang!H7>0,VLOOKUP(Rang!H7,Einstellungen!$A$3:$B$52,2,FALSE),0)","v":0},{"$f":"IF(Rang!I7>0,VLOOKUP(Rang!I7,Einstellungen!$A$3:$B$52,2,FALSE),0)","v":0},{"$f":"IF(Rang!J7>0,VLOOKUP(Rang!J7,Einstellungen!$A$3:$B$52,2,FALSE),0)","v":0},{"$f":"IF(Rang!K7>0,VLOOKUP(Rang!K7,Einstellungen!$A$3:$B$52,2,FALSE),0)","v":0},{"$f":"IF(Rang!L7>0,VLOOKUP(Rang!L7,Einstellungen!$A$3:$B$52,2,FALSE),0)","v":0},{"$f":"IF(Rang!M7>0,VLOOKUP(Rang!M7,Einstellungen!$A$3:$B$52,2,FALSE),0)","v":0},{"$f":"IF(Rang!N7>0,VLOOKUP(Rang!N7,Einstellungen!$A$3:$B$52,2,FALSE),0)","v":0},{"$f":"IF(Rang!O7>0,VLOOKUP(Rang!O7,Einstellungen!$A$3:$B$52,2,FALSE),0)","v":0},{"$f":"IF(Rang!P7>0,VLOOKUP(Rang!P7,Einstellungen!$A$3:$B$52,2,FALSE),0)","v":0},{"$f":"IF(Rang!Q7>0,VLOOKUP(Rang!Q7,Einstellungen!$A$3:$B$52,2,FALSE),0)","v":0},{"$f":"IF(Rang!R7>0,VLOOKUP(Rang!R7,Einstellungen!$A$3:$B$52,2,FALSE),0)","v":0},{"$f":"IF(Rang!S7>0,VLOOKUP(Rang!S7,Einstellungen!$A$3:$B$52,2,FALSE),0)","v":0},{"$f":"IF(Rang!T7>0,VLOOKUP(Rang!T7,Einstellungen!$A$3:$B$52,2,FALSE),0)","v":0},{"$f":"IF(Rang!U7>0,VLOOKUP(Rang!U7,Einstellungen!$A$3:$B$52,2,FALSE),0)","v":0},{"$f":"SUM(B14:U14)+IF($AY$4=2,AZ14,0)+IF($AY$4=3,BC14,0)","v":0},{"$f":"IF(SUM(B14:U14)>0,RANK(V14,$V$4:$V$53,0),0)","v":0},{"$f":"IF(SUM(B14:U14)>0,VLOOKUP(A14,TabRunden,22,FALSE),0)","v":0},{"$f":"AD14","v":0},{"$f":"IF(AD14>=$AT$2,LOOKUP($AL$2,$AE$3:$AX$3,AE14:AX14),0)+IF($AY$4=2,AZ14,0)+IF($AY$4=3,BC14,0)","v":0},{"$f":"IF(Z14>0,RANK(Z14,$Z$4:$Z$53,0),0)","v":0},{"$f":"IF(W14=0,51,W14)+IF(A14=\"\",50,0)","v":51},{"$f":"IF(AA14=0,51,AA14)+IF(A14=\"\",50,0)","v":51},0,0,{"$f":"LARGE($B14:$U14,AF$3)+AE14","v":0},0,0,0,0,0,0,0,0,0,0,0,0,0,0,0,0,0,0,null,0,0,0,{"$f":"IF(X14>0,VLOOKUP(A14,Rang!$A$4:$AU$53,47,FALSE))/1000","v":0}]
[{"$f":"IF(Runden!A11=\"\",\"\",Runden!A11)","v":"Sven"},{"$f":"IF(Rang!B11>0,VLOOKUP(Rang!B11,Einstellungen!$A$3:$B$52,2,FALSE),0)","v":0},{"$f":"IF(Rang!C11>0,VLOOKUP(Rang!C11,Einstellungen!$A$3:$B$52,2,FALSE),0)","v":0},{"$f":"IF(Rang!D11>0,VLOOKUP(Rang!D11,Einstellungen!$A$3:$B$52,2,FALSE),0)","v":0},{"$f":"IF(Rang!E11>0,VLOOKUP(Rang!E11,Einstellungen!$A$3:$B$52,2,FALSE),0)","v":0},{"$f":"IF(Rang!F11>0,VLOOKUP(Rang!F11,Einstellungen!$A$3:$B$52,2,FALSE),0)","v":0},{"$f":"IF(Rang!G11>0,VLOOKUP(Rang!G11,Einstellungen!$A$3:$B$52,2,FALSE),0)","v":0},{"$f":"IF(Rang!H11>0,VLOOKUP(Rang!H11,Einstellungen!$A$3:$B$52,2,FALSE),0)","v":0},{"$f":"IF(Rang!I11>0,VLOOKUP(Rang!I11,Einstellungen!$A$3:$B$52,2,FALSE),0)","v":0},{"$f":"IF(Rang!J11>0,VLOOKUP(Rang!J11,Einstellungen!$A$3:$B$52,2,FALSE),0)","v":0},{"$f":"IF(Rang!K11>0,VLOOKUP(Rang!K11,Einstellungen!$A$3:$B$52,2,FALSE),0)","v":0},{"$f":"IF(Rang!L11>0,VLOOKUP(Rang!L11,Einstellungen!$A$3:$B$52,2,FALSE),0)","v":0},{"$f":"IF(Rang!M11>0,VLOOKUP(Rang!M11,Einstellungen!$A$3:$B$52,2,FALSE),0)","v":0},{"$f":"IF(Rang!N11>0,VLOOKUP(Rang!N11,Einstellungen!$A$3:$B$52,2,FALSE),0)","v":0},{"$f":"IF(Rang!O11>0,VLOOKUP(Rang!O11,Einstellungen!$A$3:$B$52,2,FALSE),0)","v":0},{"$f":"IF(Rang!P11>0,VLOOKUP(Rang!P11,Einstellungen!$A$3:$B$52,2,FALSE),0)","v":0},{"$f":"IF(Rang!Q11>0,VLOOKUP(Rang!Q11,Einstellungen!$A$3:$B$52,2,FALSE),0)","v":0},{"$f":"IF(Rang!R11>0,VLOOKUP(Rang!R11,Einstellungen!$A$3:$B$52,2,FALSE),0)","v":0},{"$f":"IF(Rang!S11>0,VLOOKUP(Rang!S11,Einstellungen!$A$3:$B$52,2,FALSE),0)","v":0},{"$f":"IF(Rang!T11>0,VLOOKUP(Rang!T11,Einstellungen!$A$3:$B$52,2,FALSE),0)","v":0},{"$f":"IF(Rang!U11>0,VLOOKUP(Rang!U11,Einstellungen!$A$3:$B$52,2,FALSE),0)","v":0},{"$f":"SUM(B15:U15)+IF($AY$4=2,AZ15,0)+IF($AY$4=3,BC15,0)","v":0},{"$f":"IF(SUM(B15:U15)>0,RANK(V15,$V$4:$V$53,0),0)","v":0},{"$f":"IF(SUM(B15:U15)>0,VLOOKUP(A15,TabRunden,22,FALSE),0)","v":0},{"$f":"AD15","v":0},{"$f":"IF(AD15>=$AT$2,LOOKUP($AL$2,$AE$3:$AX$3,AE15:AX15),0)+IF($AY$4=2,AZ15,0)+IF($AY$4=3,BC15,0)","v":0},{"$f":"IF(Z15>0,RANK(Z15,$Z$4:$Z$53,0),0)","v":0},{"$f":"IF(W15=0,51,W15)+IF(A15=\"\",50,0)","v":51},{"$f":"IF(AA15=0,51,AA15)+IF(A15=\"\",50,0)","v":51},0,0,{"$f":"LARGE($B15:$U15,AF$3)+AE15","v":0},0,0,0,0,0,0,0,0,0,0,0,0,0,0,0,0,0,0,null,0,0,0,{"$f":"IF(X15>0,VLOOKUP(A15,Rang!$A$4:$AU$53,47,FALSE))/1000","v":0}]
[{"$f":"IF(Runden!A16=\"\",\"\",Runden!A16)","v":"Olli"},{"$f":"IF(Rang!B16>0,VLOOKUP(Rang!B16,Einstellungen!$A$3:$B$52,2,FALSE),0)","v":0},{"$f":"IF(Rang!C16>0,VLOOKUP(Rang!C16,Einstellungen!$A$3:$B$52,2,FALSE),0)","v":0},{"$f":"IF(Rang!D16>0,VLOOKUP(Rang!D16,Einstellungen!$A$3:$B$52,2,FALSE),0)","v":0},{"$f":"IF(Rang!E16>0,VLOOKUP(Rang!E16,Einstellungen!$A$3:$B$52,2,FALSE),0)","v":0},{"$f":"IF(Rang!F16>0,VLOOKUP(Rang!F16,Einstellungen!$A$3:$B$52,2,FALSE),0)","v":0},{"$f":"IF(Rang!G16>0,VLOOKUP(Rang!G16,Einstellungen!$A$3:$B$52,2,FALSE),0)","v":0},{"$f":"IF(Rang!H16>0,VLOOKUP(Rang!H16,Einstellungen!$A$3:$B$52,2,FALSE),0)","v":0},{"$f":"IF(Rang!I16>0,VLOOKUP(Rang!I16,Einstellungen!$A$3:$B$52,2,FALSE),0)","v":0},{"$f":"IF(Rang!J16>0,VLOOKUP(Rang!J16,Einstellungen!$A$3:$B$52,2,FALSE),0)","v":0},{"$f":"IF(Rang!K16>0,VLOOKUP(Rang!K16,Einstellungen!$A$3:$B$52,2,FALSE),0)","v":0},{"$f":"IF(Rang!L16>0,VLOOKUP(Rang!L16,Einstellungen!$A$3:$B$52,2,FALSE),0)","v":0},{"$f":"IF(Rang!M16>0,VLOOKUP(Rang!M16,Einstellungen!$A$3:$B$52,2,FALSE),0)","v":0},{"$f":"IF(Rang!N16>0,VLOOKUP(Rang!N16,Einstellungen!$A$3:$B$52,2,FALSE),0)","v":0},{"$f":"IF(Rang!O16>0,VLOOKUP(Rang!O16,Einstellungen!$A$3:$B$52,2,FALSE),0)","v":0},{"$f":"IF(Rang!P16>0,VLOOKUP(Rang!P16,Einstellungen!$A$3:$B$52,2,FALSE),0)","v":0},{"$f":"IF(Rang!Q16>0,VLOOKUP(Rang!Q16,Einstellungen!$A$3:$B$52,2,FALSE),0)","v":0},{"$f":"IF(Rang!R16>0,VLOOKUP(Rang!R16,Einstellungen!$A$3:$B$52,2,FALSE),0)","v":0},{"$f":"IF(Rang!S16>0,VLOOKUP(Rang!S16,Einstellungen!$A$3:$B$52,2,FALSE),0)","v":0},{"$f":"IF(Rang!T16>0,VLOOKUP(Rang!T16,Einstellungen!$A$3:$B$52,2,FALSE),0)","v":0},{"$f":"IF(Rang!U16>0,VLOOKUP(Rang!U16,Einstellungen!$A$3:$B$52,2,FALSE),0)","v":0},{"$f":"SUM(B16:U16)+IF($AY$4=2,AZ16,0)+IF($AY$4=3,BC16,0)","v":0},{"$f":"IF(SUM(B16:U16)>0,RANK(V16,$V$4:$V$53,0),0)","v":0},{"$f":"IF(SUM(B16:U16)>0,VLOOKUP(A16,TabRunden,22,FALSE),0)","v":0},{"$f":"AD16","v":0},{"$f":"IF(AD16>=$AT$2,LOOKUP($AL$2,$AE$3:$AX$3,AE16:AX16),0)+IF($AY$4=2,AZ16,0)+IF($AY$4=3,BC16,0)","v":0},{"$f":"IF(Z16>0,RANK(Z16,$Z$4:$Z$53,0),0)","v":0},{"$f":"IF(W16=0,51,W16)+IF(A16=\"\",50,0)","v":51},{"$f":"IF(AA16=0,51,AA16)+IF(A16=\"\",50,0)","v":51},0,0,{"$f":"LARGE($B16:$U16,AF$3)+AE16","v":0},0,0,0,0,0,0,0,0,0,0,0,0,0,0,0,0,0,0,null,0,0,0,{"$f":"IF(X16>0,VLOOKUP(A16,Rang!$A$4:$AU$53,47,FALSE))/1000","v":0}]
[{"$f":"IF(Runden!A17=\"\",\"\",Runden!A17)","v":"Horst"},{"$f":"IF(Rang!B17>0,VLOOKUP(Rang!B17,Einstellungen!$A$3:$B$52,2,FALSE),0)","v":0},{"$f":"IF(Rang!C17>0,VLOOKUP(Rang!C17,Einstellungen!$A$3:$B$52,2,FALSE),0)","v":0},{"$f":"IF(Rang!D17>0,VLOOKUP(Rang!D17,Einstellungen!$A$3:$B$52,2,FALSE),0)","v":0},{"$f":"IF(Rang!E17>0,VLOOKUP(Rang!E17,Einstellungen!$A$3:$B$52,2,FALSE),0)","v":0},{"$f":"IF(Rang!F17>0,VLOOKUP(Rang!F17,Einstellungen!$A$3:$B$52,2,FALSE),0)","v":0},{"$f":"IF(Rang!G17>0,VLOOKUP(Rang!G17,Einstellungen!$A$3:$B$52,2,FALSE),0)","v":0},{"$f":"IF(Rang!H17>0,VLOOKUP(Rang!H17,Einstellungen!$A$3:$B$52,2,FALSE),0)","v":0},{"$f":"IF(Rang!I17>0,VLOOKUP(Rang!I17,Einstellungen!$A$3:$B$52,2,FALSE),0)","v":0},{"$f":"IF(Rang!J17>0,VLOOKUP(Rang!J17,Einstellungen!$A$3:$B$52,2,FALSE),0)","v":0},{"$f":"IF(Rang!K17>0,VLOOKUP(Rang!K17,Einstellungen!$A$3:$B$52,2,FALSE),0)","v":0},{"$f":"IF(Rang!L17>0,VLOOKUP(Rang!L17,Einstellungen!$A$3:$B$52,2,FALSE),0)","v":0},{"$f":"IF(Rang!M17>0,VLOOKUP(Rang!M17,Einstellungen!$A$3:$B$52,2,FALSE),0)","v":0},{"$f":"IF(Rang!N17>0,VLOOKUP(Rang!N17,Einstellungen!$A$3:$B$52,2,FALSE),0)","v":0},{"$f":"IF(Rang!O17>0,VLOOKUP(Rang!O17,Einstellungen!$A$3:$B$52,2,FALSE),0)","v":0},{"$f":"IF(Rang!P17>0,VLOOKUP(Rang!P17,Einstellungen!$A$3:$B$52,2,FALSE),0)","v":0},{"$f":"IF(Rang!Q17>0,VLOOKUP(Rang!Q17,Einstellungen!$A$3:$B$52,2,FALSE),0)","v":0},{"$f":"IF(Rang!R17>0,VLOOKUP(Rang!R17,Einstellungen!$A$3:$B$52,2,FALSE),0)","v":0},{"$f":"IF(Rang!S17>0,VLOOKUP(Rang!S17,Einstellungen!$A$3:$B$52,2,FALSE),0)","v":0},{"$f":"IF(Rang!T17>0,VLOOKUP(Rang!T17,Einstellungen!$A$3:$B$52,2,FALSE),0)","v":0},{"$f":"IF(Rang!U17>0,VLOOKUP(Rang!U17,Einstellungen!$A$3:$B$52,2,FALSE),0)","v":0},{"$f":"SUM(B17:U17)+IF($AY$4=2,AZ17,0)+IF($AY$4=3,BC17,0)","v":0},{"$f":"IF(SUM(B17:U17)>0,RANK(V17,$V$4:$V$53,0),0)","v":0},{"$f":"IF(SUM(B17:U17)>0,VLOOKUP(A17,TabRunden,22,FALSE),0)","v":0},{"$f":"AD17","v":0},{"$f":"IF(AD17>=$AT$2,LOOKUP($AL$2,$AE$3:$AX$3,AE17:AX17),0)+IF($AY$4=2,AZ17,0)+IF($AY$4=3,BC17,0)","v":0},{"$f":"IF(Z17>0,RANK(Z17,$Z$4:$Z$53,0),0)","v":0},{"$f":"IF(W17=0,51,W17)+IF(A17=\"\",50,0)","v":51},{"$f":"IF(AA17=0,51,AA17)+IF(A17=\"\",50,0)","v":51},0,0,{"$f":"LARGE($B17:$U17,AF$3)+AE17","v":0},0,0,0,0,0,0,0,0,0,0,0,0,0,0,0,0,0,0,null,0,0,0,{"$f":"IF(X17>0,VLOOKUP(A17,Rang!$A$4:$AU$53,47,FALSE))/1000","v":0}]
[{"$f":"IF(Runden!A18=\"\",\"\",Runden!A18)","v":""},{"$f":"IF(Rang!B18>0,VLOOKUP(Rang!B18,Einstellungen!$A$3:$B$52,2,FALSE),0)","v":0},{"$f":"IF(Rang!C18>0,VLOOKUP(Rang!C18,Einstellungen!$A$3:$B$52,2,FALSE),0)","v":0},{"$f":"IF(Rang!D18>0,VLOOKUP(Rang!D18,Einstellungen!$A$3:$B$52,2,FALSE),0)","v":0},{"$f":"IF(Rang!E18>0,VLOOKUP(Rang!E18,Einstellungen!$A$3:$B$52,2,FALSE),0)","v":0},{"$f":"IF(Rang!F18>0,VLOOKUP(Rang!F18,Einstellungen!$A$3:$B$52,2,FALSE),0)","v":0},{"$f":"IF(Rang!G18>0,VLOOKUP(Rang!G18,Einstellungen!$A$3:$B$52,2,FALSE),0)","v":0},{"$f":"IF(Rang!H18>0,VLOOKUP(Rang!H18,Einstellungen!$A$3:$B$52,2,FALSE),0)","v":0},{"$f":"IF(Rang!I18>0,VLOOKUP(Rang!I18,Einstellungen!$A$3:$B$52,2,FALSE),0)","v":0},{"$f":"IF(Rang!J18>0,VLOOKUP(Rang!J18,Einstellungen!$A$3:$B$52,2,FALSE),0)","v":0},{"$f":"IF(Rang!K18>0,VLOOKUP(Rang!K18,Einstellungen!$A$3:$B$52,2,FALSE),0)","v":0},{"$f":"IF(Rang!L18>0,VLOOKUP(Rang!L18,Einstellungen!$A$3:$B$52,2,FALSE),0)","v":0},{"$f":"IF(Rang!M18>0,VLOOKUP(Rang!M18,Einstellungen!$A$3:$B$52,2,FALSE),0)","v":0},{"$f":"IF(Rang!N18>0,VLOOKUP(Rang!N18,Einstellungen!$A$3:$B$52,2,FALSE),0)","v":0},{"$f":"IF(Rang!O18>0,VLOOKUP(Rang!O18,Einstellungen!$A$3:$B$52,2,FALSE),0)","v":0},{"$f":"IF(Rang!P18>0,VLOOKUP(Rang!P18,Einstellungen!$A$3:$B$52,2,FALSE),0)","v":0},{"$f":"IF(Rang!Q18>0,VLOOKUP(Rang!Q18,Einstellungen!$A$3:$B$52,2,FALSE),0)","v":0},{"$f":"IF(Rang!R18>0,VLOOKUP(Rang!R18,Einstellungen!$A$3:$B$52,2,FALSE),0)","v":0},{"$f":"IF(Rang!S18>0,VLOOKUP(Rang!S18,Einstellungen!$A$3:$B$52,2,FALSE),0)","v":0},{"$f":"IF(Rang!T18>0,VLOOKUP(Rang!T18,Einstellungen!$A$3:$B$52,2,FALSE),0)","v":0},{"$f":"IF(Rang!U18>0,VLOOKUP(Rang!U18,Einstellungen!$A$3:$B$52,2,FALSE),0)","v":0},{"$f":"SUM(B18:U18)+IF($AY$4=2,AZ18,0)+IF($AY$4=3,BC18,0)","v":0},{"$f":"IF(SUM(B18:U18)>0,RANK(V18,$V$4:$V$53,0),0)","v":0},{"$f":"IF(SUM(B18:U18)>0,VLOOKUP(A18,TabRunden,22,FALSE),0)","v":0},{"$f":"AD18","v":0},{"$f":"IF(AD18>=$AT$2,LOOKUP($AL$2,$AE$3:$AX$3,AE18:AX18),0)+IF($AY$4=2,AZ18,0)+IF($AY$4=3,BC18,0)","v":0},{"$f":"IF(Z18>0,RANK(Z18,$Z$4:$Z$53,0),0)","v":0},{"$f":"IF(W18=0,51,W18)+IF(A18=\"\",50,0)","v":101},{"$f":"IF(AA18=0,51,AA18)+IF(A18=\"\",50,0)","v":101},0,0,{"$f":"LARGE($B18:$U18,AF$3)+AE18","v":0},0,0,0,0,0,0,0,0,0,0,0,0,0,0,0,0,0,0,null,0,{"$f":"AX18+AZ18","v":0},0,{"$f":"IF(X18>0,VLOOKUP(A18,Rang!$A$4:$AU$53,47,FALSE))/1000","v":0}]
[{"$f":"IF(Runden!A19=\"\",\"\",Runden!A19)","v":""},{"$f":"IF(Rang!B19>0,VLOOKUP(Rang!B19,Einstellungen!$A$3:$B$52,2,FALSE),0)","v":0},{"$f":"IF(Rang!C19>0,VLOOKUP(Rang!C19,Einstellungen!$A$3:$B$52,2,FALSE),0)","v":0},{"$f":"IF(Rang!D19>0,VLOOKUP(Rang!D19,Einstellungen!$A$3:$B$52,2,FALSE),0)","v":0},{"$f":"IF(Rang!E19>0,VLOOKUP(Rang!E19,Einstellungen!$A$3:$B$52,2,FALSE),0)","v":0},{"$f":"IF(Rang!F19>0,VLOOKUP(Rang!F19,Einstellungen!$A$3:$B$52,2,FALSE),0)","v":0},{"$f":"IF(Rang!G19>0,VLOOKUP(Rang!G19,Einstellungen!$A$3:$B$52,2,FALSE),0)","v":0},{"$f":"IF(Rang!H19>0,VLOOKUP(Rang!H19,Einstellungen!$A$3:$B$52,2,FALSE),0)","v":0},{"$f":"IF(Rang!I19>0,VLOOKUP(Rang!I19,Einstellungen!$A$3:$B$52,2,FALSE),0)","v":0},{"$f":"IF(Rang!J19>0,VLOOKUP(Rang!J19,Einstellungen!$A$3:$B$52,2,FALSE),0)","v":0},{"$f":"IF(Rang!K19>0,VLOOKUP(Rang!K19,Einstellungen!$A$3:$B$52,2,FALSE),0)","v":0},{"$f":"IF(Rang!L19>0,VLOOKUP(Rang!L19,Einstellungen!$A$3:$B$52,2,FALSE),0)","v":0},{"$f":"IF(Rang!M19>0,VLOOKUP(Rang!M19,Einstellungen!$A$3:$B$52,2,FALSE),0)","v":0},{"$f":"IF(Rang!N19>0,VLOOKUP(Rang!N19,Einstellungen!$A$3:$B$52,2,FALSE),0)","v":0},{"$f":"IF(Rang!O19>0,VLOOKUP(Rang!O19,Einstellungen!$A$3:$B$52,2,FALSE),0)","v":0},{"$f":"IF(Rang!P19>0,VLOOKUP(Rang!P19,Einstellungen!$A$3:$B$52,2,FALSE),0)","v":0},{"$f":"IF(Rang!Q19>0,VLOOKUP(Rang!Q19,Einstellungen!$A$3:$B$52,2,FALSE),0)","v":0},{"$f":"IF(Rang!R19>0,VLOOKUP(Rang!R19,Einstellungen!$A$3:$B$52,2,FALSE),0)","v":0},{"$f":"IF(Rang!S19>0,VLOOKUP(Rang!S19,Einstellungen!$A$3:$B$52,2,FALSE),0)","v":0},{"$f":"IF(Rang!T19>0,VLOOKUP(Rang!T19,Einstellungen!$A$3:$B$52,2,FALSE),0)","v":0},{"$f":"IF(Rang!U19>0,VLOOKUP(Rang!U19,Einstellungen!$A$3:$B$52,2,FALSE),0)","v":0},{"$f":"SUM(B19:U19)+IF($AY$4=2,AZ19,0)+IF($AY$4=3,BC19,0)","v":0},{"$f":"IF(SUM(B19:U19)>0,RANK(V19,$V$4:$V$53,0),0)","v":0},{"$f":"IF(SUM(B19:U19)>0,VLOOKUP(A19,TabRunden,22,FALSE),0)","v":0},{"$f":"AD19","v":0},{"$f":"IF(AD19>=$AT$2,LOOKUP($AL$2,$AE$3:$AX$3,AE19:AX19),0)+IF($AY$4=2,AZ19,0)+IF($AY$4=3,BC19,0)","v":0},{"$f":"IF(Z19>0,RANK(Z19,$Z$4:$Z$53,0),0)","v":0},{"$f":"IF(W19=0,51,W19)+IF(A19=\"\",50,0)","v":101},{"$f":"IF(AA19=0,51,AA19)+IF(A19=\"\",50,0)","v":101},0,0,{"$f":"LARGE($B19:$U19,AF$3)+AE19","v":0},0,0,0,0,0,0,0,0,0,0,0,0,0,0,0,0,0,0,null,0,{"$f":"AX19+AZ19","v":0},0,{"$f":"IF(X19>0,VLOOKUP(A19,Rang!$A$4:$AU$53,47,FALSE))/1000","v":0}]
[{"$f":"IF(Runden!A20=\"\",\"\",Runden!A20)","v":""},{"$f":"IF(Rang!B20>0,VLOOKUP(Rang!B20,Einstellungen!$A$3:$B$52,2,FALSE),0)","v":0},{"$f":"IF(Rang!C20>0,VLOOKUP(Rang!C20,Einstellungen!$A$3:$B$52,2,FALSE),0)","v":0},{"$f":"IF(Rang!D20>0,VLOOKUP(Rang!D20,Einstellungen!$A$3:$B$52,2,FALSE),0)","v":0},{"$f":"IF(Rang!E20>0,VLOOKUP(Rang!E20,Einstellungen!$A$3:$B$52,2,FALSE),0)","v":0},{"$f":"IF(Rang!F20>0,VLOOKUP(Rang!F20,Einstellungen!$A$3:$B$52,2,FALSE),0)","v":0},{"$f":"IF(Rang!G20>0,VLOOKUP(Rang!G20,Einstellungen!$A$3:$B$52,2,FALSE),0)","v":0},{"$f":"IF(Rang!H20>0,VLOOKUP(Rang!H20,Einstellungen!$A$3:$B$52,2,FALSE),0)","v":0},{"$f":"IF(Rang!I20>0,VLOOKUP(Rang!I20,Einstellungen!$A$3:$B$52,2,FALSE),0)","v":0},{"$f":"IF(Rang!J20>0,VLOOKUP(Rang!J20,Einstellungen!$A$3:$B$52,2,FALSE),0)","v":0},{"$f":"IF(Rang!K20>0,VLOOKUP(Rang!K20,Einstellungen!$A$3:$B$52,2,FALSE),0)","v":0},{"$f":"IF(Rang!L20>0,VLOOKUP(Rang!L20,Einstellungen!$A$3:$B$52,2,FALSE),0)","v":0},{"$f":"IF(Rang!M20>0,VLOOKUP(Rang!M20,Einstellungen!$A$3:$B$52,2,FALSE),0)","v":0},{"$f":"IF(Rang!N20>0,VLOOKUP(Rang!N20,Einstellungen!$A$3:$B$52,2,FALSE),0)","v":0},{"$f":"IF(Rang!O20>0,VLOOKUP(Rang!O20,Einstellungen!$A$3:$B$52,2,FALSE),0)","v":0},{"$f":"IF(Rang!P20>0,VLOOKUP(Rang!P20,Einstellungen!$A$3:$B$52,2,FALSE),0)","v":0},{"$f":"IF(Rang!Q20>0,VLOOKUP(Rang!Q20,Einstellungen!$A$3:$B$52,2,FALSE),0)","v":0},{"$f":"IF(Rang!R20>0,VLOOKUP(Rang!R20,Einstellungen!$A$3:$B$52,2,FALSE),0)","v":0},{"$f":"IF(Rang!S20>0,VLOOKUP(Rang!S20,Einstellungen!$A$3:$B$52,2,FALSE),0)","v":0},{"$f":"IF(Rang!T20>0,VLOOKUP(Rang!T20,Einstellungen!$A$3:$B$52,2,FALSE),0)","v":0},{"$f":"IF(Rang!U20>0,VLOOKUP(Rang!U20,Einstellungen!$A$3:$B$52,2,FALSE),0)","v":0},{"$f":"SUM(B20:U20)+IF($AY$4=2,AZ20,0)+IF($AY$4=3,BC20,0)","v":0},{"$f":"IF(SUM(B20:U20)>0,RANK(V20,$V$4:$V$53,0),0)","v":0},{"$f":"IF(SUM(B20:U20)>0,VLOOKUP(A20,TabRunden,22,FALSE),0)","v":0},{"$f":"AD20","v":0},{"$f":"IF(AD20>=$AT$2,LOOKUP($AL$2,$AE$3:$AX$3,AE20:AX20),0)+IF($AY$4=2,AZ20,0)+IF($AY$4=3,BC20,0)","v":0},{"$f":"IF(Z20>0,RANK(Z20,$Z$4:$Z$53,0),0)","v":0},{"$f":"IF(W20=0,51,W20)+IF(A20=\"\",50,0)","v":101},{"$f":"IF(AA20=0,51,AA20)+IF(A20=\"\",50,0)","v":101},0,0,{"$f":"LARGE($B20:$U20,AF$3)+AE20","v":0},0,0,0,0,0,0,0,0,0,0,0,0,0,0,0,0,0,0,null,0,0,0,{"$f":"IF(X20>0,VLOOKUP(A20,Rang!$A$4:$AU$53,47,FALSE))/1000","v":0}]
[{"$f":"IF(Runden!A21=\"\",\"\",Runden!A21)","v":""},{"$f":"IF(Rang!B21>0,VLOOKUP(Rang!B21,Einstellungen!$A$3:$B$52,2,FALSE),0)","v":0},{"$f":"IF(Rang!C21>0,VLOOKUP(Rang!C21,Einstellungen!$A$3:$B$52,2,FALSE),0)","v":0},{"$f":"IF(Rang!D21>0,VLOOKUP(Rang!D21,Einstellungen!$A$3:$B$52,2,FALSE),0)","v":0},{"$f":"IF(Rang!E21>0,VLOOKUP(Rang!E21,Einstellungen!$A$3:$B$52,2,FALSE),0)","v":0},{"$f":"IF(Rang!F21>0,VLOOKUP(Rang!F21,Einstellungen!$A$3:$B$52,2,FALSE),0)","v":0},{"$f":"IF(Rang!G21>0,VLOOKUP(Rang!G21,Einstellungen!$A$3:$B$52,2,FALSE),0)","v":0},{"$f":"IF(Rang!H21>0,VLOOKUP(Rang!H21,Einstellungen!$A$3:$B$52,2,FALSE),0)","v":0},{"$f":"IF(Rang!I21>0,VLOOKUP(Rang!I21,Einstellungen!$A$3:$B$52,2,FALSE),0)","v":0},{"$f":"IF(Rang!J21>0,VLOOKUP(Rang!J21,Einstellungen!$A$3:$B$52,2,FALSE),0)","v":0},{"$f":"IF(Rang!K21>0,VLOOKUP(Rang!K21,Einstellungen!$A$3:$B$52,2,FALSE),0)","v":0},{"$f":"IF(Rang!L21>0,VLOOKUP(Rang!L21,Einstellungen!$A$3:$B$52,2,FALSE),0)","v":0},{"$f":"IF(Rang!M21>0,VLOOKUP(Rang!M21,Einstellungen!$A$3:$B$52,2,FALSE),0)","v":0},{"$f":"IF(Rang!N21>0,VLOOKUP(Rang!N21,Einstellungen!$A$3:$B$52,2,FALSE),0)","v":0},{"$f":"IF(Rang!O21>0,VLOOKUP(Rang!O21,Einstellungen!$A$3:$B$52,2,FALSE),0)","v":0},{"$f":"IF(Rang!P21>0,VLOOKUP(Rang!P21,Einstellungen!$A$3:$B$52,2,FALSE),0)","v":0},{"$f":"IF(Rang!Q21>0,VLOOKUP(Rang!Q21,Einstellungen!$A$3:$B$52,2,FALSE),0)","v":0},{"$f":"IF(Rang!R21>0,VLOOKUP(Rang!R21,Einstellungen!$A$3:$B$52,2,FALSE),0)","v":0},{"$f":"IF(Rang!S21>0,VLOOKUP(Rang!S21,Einstellungen!$A$3:$B$52,2,FALSE),0)","v":0},{"$f":"IF(Rang!T21>0,VLOOKUP(Rang!T21,Einstellungen!$A$3:$B$52,2,FALSE),0)","v":0},{"$f":"IF(Rang!U21>0,VLOOKUP(Rang!U21,Einstellungen!$A$3:$B$52,2,FALSE),0)","v":0},{"$f":"SUM(B21:U21)+IF($AY$4=2,AZ21,0)+IF($AY$4=3,BC21,0)","v":0},{"$f":"IF(SUM(B21:U21)>0,RANK(V21,$V$4:$V$53,0),0)","v":0},{"$f":"IF(SUM(B21:U21)>0,VLOOKUP(A21,TabRunden,22,FALSE),0)","v":0},{"$f":"AD21","v":0},{"$f":"IF(AD21>=$AT$2,LOOKUP($AL$2,$AE$3:$AX$3,AE21:AX21),0)+IF($AY$4=2,AZ21,0)+IF($AY$4=3,BC21,0)","v":0},{"$f":"IF(Z21>0,RANK(Z21,$Z$4:$Z$53,0),0)","v":0},{"$f":"IF(W21=0,51,W21)+IF(A21=\"\",50,0)","v":101},{"$f":"IF(AA21=0,51,AA21)+IF(A21=\"\",50,0)","v":101},0,0,{"$f":"LARGE($B21:$U21,AF$3)+AE21","v":0},0,0,0,0,0,0,0,0,0,0,0,0,0,0,0,0,0,0,null,0,0,0,{"$f":"IF(X21>0,VLOOKUP(A21,Rang!$A$4:$AU$53,47,FALSE))/1000","v":0}]
[{"$f":"IF(Runden!A22=\"\",\"\",Runden!A22)","v":""},{"$f":"IF(Rang!B22>0,VLOOKUP(Rang!B22,Einstellungen!$A$3:$B$52,2,FALSE),0)","v":0},{"$f":"IF(Rang!C22>0,VLOOKUP(Rang!C22,Einstellungen!$A$3:$B$52,2,FALSE),0)","v":0},{"$f":"IF(Rang!D22>0,VLOOKUP(Rang!D22,Einstellungen!$A$3:$B$52,2,FALSE),0)","v":0},{"$f":"IF(Rang!E22>0,VLOOKUP(Rang!E22,Einstellungen!$A$3:$B$52,2,FALSE),0)","v":0},{"$f":"IF(Rang!F22>0,VLOOKUP(Rang!F22,Einstellungen!$A$3:$B$52,2,FALSE),0)","v":0},{"$f":"IF(Rang!G22>0,VLOOKUP(Rang!G22,Einstellungen!$A$3:$B$52,2,FALSE),0)","v":0},{"$f":"IF(Rang!H22>0,VLOOKUP(Rang!H22,Einstellungen!$A$3:$B$52,2,FALSE),0)","v":0},{"$f":"IF(Rang!I22>0,VLOOKUP(Rang!I22,Einstellungen!$A$3:$B$52,2,FALSE),0)","v":0},{"$f":"IF(Rang!J22>0,VLOOKUP(Rang!J22,Einstellungen!$A$3:$B$52,2,FALSE),0)","v":0},{"$f":"IF(Rang!K22>0,VLOOKUP(Rang!K22,Einstellungen!$A$3:$B$52,2,FALSE),0)","v":0},{"$f":"IF(Rang!L22>0,VLOOKUP(Rang!L22,Einstellungen!$A$3:$B$52,2,FALSE),0)","v":0},{"$f":"IF(Rang!M22>0,VLOOKUP(Rang!M22,Einstellungen!$A$3:$B$52,2,FALSE),0)","v":0},{"$f":"IF(Rang!N22>0,VLOOKUP(Rang!N22,Einstellungen!$A$3:$B$52,2,FALSE),0)","v":0},{"$f":"IF(Rang!O22>0,VLOOKUP(Rang!O22,Einstellungen!$A$3:$B$52,2,FALSE),0)","v":0},{"$f":"IF(Rang!P22>0,VLOOKUP(Rang!P22,Einstellungen!$A$3:$B$52,2,FALSE),0)","v":0},{"$f":"IF(Rang!Q22>0,VLOOKUP(Rang!Q22,Einstellungen!$A$3:$B$52,2,FALSE),0)","v":0},{"$f":"IF(Rang!R22>0,VLOOKUP(Rang!R22,Einstellungen!$A$3:$B$52,2,FALSE),0)","v":0},{"$f":"IF(Rang!S22>0,VLOOKUP(Rang!S22,Einstellungen!$A$3:$B$52,2,FALSE),0)","v":0},{"$f":"IF(Rang!T22>0,VLOOKUP(Rang!T22,Einstellungen!$A$3:$B$52,2,FALSE),0)","v":0},{"$f":"IF(Rang!U22>0,VLOOKUP(Rang!U22,Einstellungen!$A$3:$B$52,2,FALSE),0)","v":0},{"$f":"SUM(B22:U22)+IF($AY$4=2,AZ22,0)+IF($AY$4=3,BC22,0)","v":0},{"$f":"IF(SUM(B22:U22)>0,RANK(V22,$V$4:$V$53,0),0)","v":0},{"$f":"IF(SUM(B22:U22)>0,VLOOKUP(A22,TabRunden,22,FALSE),0)","v":0},{"$f":"AD22","v":0},{"$f":"IF(AD22>=$AT$2,LOOKUP($AL$2,$AE$3:$AX$3,AE22:AX22),0)+IF($AY$4=2,AZ22,0)+IF($AY$4=3,BC22,0)","v":0},{"$f":"IF(Z22>0,RANK(Z22,$Z$4:$Z$53,0),0)","v":0},{"$f":"IF(W22=0,51,W22)+IF(A22=\"\",50,0)","v":101},{"$f":"IF(AA22=0,51,AA22)+IF(A22=\"\",50,0)","v":101},0,0,{"$f":"LARGE($B22:$U22,AF$3)+AE22","v":0},0,0,0,0,0,0,0,0,0,0,0,0,0,0,0,0,0,0,null,0,0,0,{"$f":"IF(X22>0,VLOOKUP(A22,Rang!$A$4:$AU$53,47,FALSE))/1000","v":0}]
[{"$f":"IF(Runden!A23=\"\",\"\",Runden!A23)","v":""},{"$f":"IF(Rang!B23>0,VLOOKUP(Rang!B23,Einstellungen!$A$3:$B$52,2,FALSE),0)","v":0},{"$f":"IF(Rang!C23>0,VLOOKUP(Rang!C23,Einstellungen!$A$3:$B$52,2,FALSE),0)","v":0},{"$f":"IF(Rang!D23>0,VLOOKUP(Rang!D23,Einstellungen!$A$3:$B$52,2,FALSE),0)","v":0},{"$f":"IF(Rang!E23>0,VLOOKUP(Rang!E23,Einstellungen!$A$3:$B$52,2,FALSE),0)","v":0},{"$f":"IF(Rang!F23>0,VLOOKUP(Rang!F23,Einstellungen!$A$3:$B$52,2,FALSE),0)","v":0},{"$f":"IF(Rang!G23>0,VLOOKUP(Rang!G23,Einstellungen!$A$3:$B$52,2,FALSE),0)","v":0},{"$f":"IF(Rang!H23>0,VLOOKUP(Rang!H23,Einstellungen!$A$3:$B$52,2,FALSE),0)","v":0},{"$f":"IF(Rang!I23>0,VLOOKUP(Rang!I23,Einstellungen!$A$3:$B$52,2,FALSE),0)","v":0},{"$f":"IF(Rang!J23>0,VLOOKUP(Rang!J23,Einstellungen!$A$3:$B$52,2,FALSE),0)","v":0},{"$f":"IF(Rang!K23>0,VLOOKUP(Rang!K23,Einstellungen!$A$3:$B$52,2,FALSE),0)","v":0},{"$f":"IF(Rang!L23>0,VLOOKUP(Rang!L23,Einstellungen!$A$3:$B$52,2,FALSE),0)","v":0},{"$f":"IF(Rang!M23>0,VLOOKUP(Rang!M23,Einstellungen!$A$3:$B$52,2,FALSE),0)","v":0},{"$f":"IF(Rang!N23>0,VLOOKUP(Rang!N23,Einstellungen!$A$3:$B$52,2,FALSE),0)","v":0},{"$f":"IF(Rang!O23>0,VLOOKUP(Rang!O23,Einstellungen!$A$3:$B$52,2,FALSE),0)","v":0},{"$f":"IF(Rang!P23>0,VLOOKUP(Rang!P23,Einstellungen!$A$3:$B$52,2,FALSE),0)","v":0},{"$f":"IF(Rang!Q23>0,VLOOKUP(Rang!Q23,Einstellungen!$A$3:$B$52,2,FALSE),0)","v":0},{"$f":"IF(Rang!R23>0,VLOOKUP(Rang!R23,Einstellungen!$A$3:$B$52,2,FALSE),0)","v":0},{"$f":"IF(Rang!S23>0,VLOOKUP(Rang!S23,Einstellungen!$A$3:$B$52,2,FALSE),0)","v":0},{"$f":"IF(Rang!T23>0,VLOOKUP(Rang!T23,Einstellungen!$A$3:$B$52,2,FALSE),0)","v":0},{"$f":"IF(Rang!U23>0,VLOOKUP(Rang!U23,Einstellungen!$A$3:$B$52,2,FALSE),0)","v":0},{"$f":"SUM(B23:U23)+IF($AY$4=2,AZ23,0)+IF($AY$4=3,BC23,0)","v":0},{"$f":"IF(SUM(B23:U23)>0,RANK(V23,$V$4:$V$53,0),0)","v":0},{"$f":"IF(SUM(B23:U23)>0,VLOOKUP(A23,TabRunden,22,FALSE),0)","v":0},{"$f":"AD23","v":0},{"$f":"IF(AD23>=$AT$2,LOOKUP($AL$2,$AE$3:$AX$3,AE23:AX23),0)+IF($AY$4=2,AZ23,0)+IF($AY$4=3,BC23,0)","v":0},{"$f":"IF(Z23>0,RANK(Z23,$Z$4:$Z$53,0),0)","v":0},{"$f":"IF(W23=0,51,W23)+IF(A23=\"\",50,0)","v":101},{"$f":"IF(AA23=0,51,AA23)+IF(A23=\"\",50,0)","v":101},0,0,{"$f":"LARGE($B23:$U23,AF$3)+AE23","v":0},0,0,0,0,0,0,0,0,0,0,0,0,0,0,0,0,0,0,null,0,0,0,{"$f":"IF(X23>0,VLOOKUP(A23,Rang!$A$4:$AU$53,47,FALSE))/1000","v":0}]
[{"$f":"IF(Runden!A24=\"\",\"\",Runden!A24)","v":""},{"$f":"IF(Rang!B24>0,VLOOKUP(Rang!B24,Einstellungen!$A$3:$B$52,2,FALSE),0)","v":0},{"$f":"IF(Rang!C24>0,VLOOKUP(Rang!C24,Einstellungen!$A$3:$B$52,2,FALSE),0)","v":0},{"$f":"IF(Rang!D24>0,VLOOKUP(Rang!D24,Einstellungen!$A$3:$B$52,2,FALSE),0)","v":0},{"$f":"IF(Rang!E24>0,VLOOKUP(Rang!E24,Einstellungen!$A$3:$B$52,2,FALSE),0)","v":0},{"$f":"IF(Rang!F24>0,VLOOKUP(Rang!F24,Einstellungen!$A$3:$B$52,2,FALSE),0)","v":0},{"$f":"IF(Rang!G24>0,VLOOKUP(Rang!G24,Einstellungen!$A$3:$B$52,2,FALSE),0)","v":0},{"$f":"IF(Rang!H24>0,VLOOKUP(Rang!H24,Einstellungen!$A$3:$B$52,2,FALSE),0)","v":0},{"$f":"IF(Rang!I24>0,VLOOKUP(Rang!I24,Einstellungen!$A$3:$B$52,2,FALSE),0)","v":0},{"$f":"IF(Rang!J24>0,VLOOKUP(Rang!J24,Einstellungen!$A$3:$B$52,2,FALSE),0)","v":0},{"$f":"IF(Rang!K24>0,VLOOKUP(Rang!K24,Einstellungen!$A$3:$B$52,2,FALSE),0)","v":0},{"$f":"IF(Rang!L24>0,VLOOKUP(Rang!L24,Einstellungen!$A$3:$B$52,2,FALSE),0)","v":0},{"$f":"IF(Rang!M24>0,VLOOKUP(Rang!M24,Einstellungen!$A$3:$B$52,2,FALSE),0)","v":0},{"$f":"IF(Rang!N24>0,VLOOKUP(Rang!N24,Einstellungen!$A$3:$B$52,2,FALSE),0)","v":0},{"$f":"IF(Rang!O24>0,VLOOKUP(Rang!O24,Einstellungen!$A$3:$B$52,2,FALSE),0)","v":0},{"$f":"IF(Rang!P24>0,VLOOKUP(Rang!P24,Einstellungen!$A$3:$B$52,2,FALSE),0)","v":0},{"$f":"IF(Rang!Q24>0,VLOOKUP(Rang!Q24,Einstellungen!$A$3:$B$52,2,FALSE),0)","v":0},{"$f":"IF(Rang!R24>0,VLOOKUP(Rang!R24,Einstellungen!$A$3:$B$52,2,FALSE),0)","v":0},{"$f":"IF(Rang!S24>0,VLOOKUP(Rang!S24,Einstellungen!$A$3:$B$52,2,FALSE),0)","v":0},{"$f":"IF(Rang!T24>0,VLOOKUP(Rang!T24,Einstellungen!$A$3:$B$52,2,FALSE),0)","v":0},{"$f":"IF(Rang!U24>0,VLOOKUP(Rang!U24,Einstellungen!$A$3:$B$52,2,FALSE),0)","v":0},{"$f":"SUM(B24:U24)+IF($AY$4=2,AZ24,0)+IF($AY$4=3,BC24,0)","v":0},{"$f":"IF(SUM(B24:U24)>0,RANK(V24,$V$4:$V$53,0),0)","v":0},{"$f":"IF(SUM(B24:U24)>0,VLOOKUP(A24,TabRunden,22,FALSE),0)","v":0},{"$f":"AD24","v":0},{"$f":"IF(AD24>=$AT$2,LOOKUP($AL$2,$AE$3:$AX$3,AE24:AX24),0)+IF($AY$4=2,AZ24,0)+IF($AY$4=3,BC24,0)","v":0},{"$f":"IF(Z24>0,RANK(Z24,$Z$4:$Z$53,0),0)","v":0},{"$f":"IF(W24=0,51,W24)+IF(A24=\"\",50,0)","v":101},{"$f":"IF(AA24=0,51,AA24)+IF(A24=\"\",50,0)","v":101},0,0,{"$f":"LARGE($B24:$U24,AF$3)+AE24","v":0},0,0,0,0,0,0,0,0,0,0,0,0,0,0,0,0,0,0,null,0,0,0,{"$f":"IF(X24>0,VLOOKUP(A24,Rang!$A$4:$AU$53,47,FALSE))/1000","v":0}]
[{"$f":"IF(Runden!A25=\"\",\"\",Runden!A25)","v":""},{"$f":"IF(Rang!B25>0,VLOOKUP(Rang!B25,Einstellungen!$A$3:$B$52,2,FALSE),0)","v":0},{"$f":"IF(Rang!C25>0,VLOOKUP(Rang!C25,Einstellungen!$A$3:$B$52,2,FALSE),0)","v":0},{"$f":"IF(Rang!D25>0,VLOOKUP(Rang!D25,Einstellungen!$A$3:$B$52,2,FALSE),0)","v":0},{"$f":"IF(Rang!E25>0,VLOOKUP(Rang!E25,Einstellungen!$A$3:$B$52,2,FALSE),0)","v":0},{"$f":"IF(Rang!F25>0,VLOOKUP(Rang!F25,Einstellungen!$A$3:$B$52,2,FALSE),0)","v":0},{"$f":"IF(Rang!G25>0,VLOOKUP(Rang!G25,Einstellungen!$A$3:$B$52,2,FALSE),0)","v":0},{"$f":"IF(Rang!H25>0,VLOOKUP(Rang!H25,Einstellungen!$A$3:$B$52,2,FALSE),0)","v":0},{"$f":"IF(Rang!I25>0,VLOOKUP(Rang!I25,Einstellungen!$A$3:$B$52,2,FALSE),0)","v":0},{"$f":"IF(Rang!J25>0,VLOOKUP(Rang!J25,Einstellungen!$A$3:$B$52,2,FALSE),0)","v":0},{"$f":"IF(Rang!K25>0,VLOOKUP(Rang!K25,Einstellungen!$A$3:$B$52,2,FALSE),0)","v":0},{"$f":"IF(Rang!L25>0,VLOOKUP(Rang!L25,Einstellungen!$A$3:$B$52,2,FALSE),0)","v":0},{"$f":"IF(Rang!M25>0,VLOOKUP(Rang!M25,Einstellungen!$A$3:$B$52,2,FALSE),0)","v":0},{"$f":"IF(Rang!N25>0,VLOOKUP(Rang!N25,Einstellungen!$A$3:$B$52,2,FALSE),0)","v":0},{"$f":"IF(Rang!O25>0,VLOOKUP(Rang!O25,Einstellungen!$A$3:$B$52,2,FALSE),0)","v":0},{"$f":"IF(Rang!P25>0,VLOOKUP(Rang!P25,Einstellungen!$A$3:$B$52,2,FALSE),0)","v":0},{"$f":"IF(Rang!Q25>0,VLOOKUP(Rang!Q25,Einstellungen!$A$3:$B$52,2,FALSE),0)","v":0},{"$f":"IF(Rang!R25>0,VLOOKUP(Rang!R25,Einstellungen!$A$3:$B$52,2,FALSE),0)","v":0},{"$f":"IF(Rang!S25>0,VLOOKUP(Rang!S25,Einstellungen!$A$3:$B$52,2,FALSE),0)","v":0},{"$f":"IF(Rang!T25>0,VLOOKUP(Rang!T25,Einstellungen!$A$3:$B$52,2,FALSE),0)","v":0},{"$f":"IF(Rang!U25>0,VLOOKUP(Rang!U25,Einstellungen!$A$3:$B$52,2,FALSE),0)","v":0},{"$f":"SUM(B25:U25)+IF($AY$4=2,AZ25,0)+IF($AY$4=3,BC25,0)","v":0},{"$f":"IF(SUM(B25:U25)>0,RANK(V25,$V$4:$V$53,0),0)","v":0},{"$f":"IF(SUM(B25:U25)>0,VLOOKUP(A25,TabRunden,22,FALSE),0)","v":0},{"$f":"AD25","v":0},{"$f":"IF(AD25>=$AT$2,LOOKUP($AL$2,$AE$3:$AX$3,AE25:AX25),0)+IF($AY$4=2,AZ25,0)+IF($AY$4=3,BC25,0)","v":0},{"$f":"IF(Z25>0,RANK(Z25,$Z$4:$Z$53,0),0)","v":0},{"$f":"IF(W25=0,51,W25)+IF(A25=\"\",50,0)","v":101},{"$f":"IF(AA25=0,51,AA25)+IF(A25=\"\",50,0)","v":101},0,0,{"$f":"LARGE($B25:$U25,AF$3)+AE25","v":0},0,0,0,0,0,0,0,0,0,0,0,0,0,0,0,0,0,0,null,0,0,0,{"$f":"IF(X25>0,VLOOKUP(A25,Rang!$A$4:$AU$53,47,FALSE))/1000","v":0}]
[{"$f":"IF(Runden!A26=\"\",\"\",Runden!A26)","v":""},{"$f":"IF(Rang!B26>0,VLOOKUP(Rang!B26,Einstellungen!$A$3:$B$52,2,FALSE),0)","v":0},{"$f":"IF(Rang!C26>0,VLOOKUP(Rang!C26,Einstellungen!$A$3:$B$52,2,FALSE),0)","v":0},{"$f":"IF(Rang!D26>0,VLOOKUP(Rang!D26,Einstellungen!$A$3:$B$52,2,FALSE),0)","v":0},{"$f":"IF(Rang!E26>0,VLOOKUP(Rang!E26,Einstellungen!$A$3:$B$52,2,FALSE),0)","v":0},{"$f":"IF(Rang!F26>0,VLOOKUP(Rang!F26,Einstellungen!$A$3:$B$52,2,FALSE),0)","v":0},{"$f":"IF(Rang!G26>0,VLOOKUP(Rang!G26,Einstellungen!$A$3:$B$52,2,FALSE),0)","v":0},{"$f":"IF(Rang!H26>0,VLOOKUP(Rang!H26,Einstellungen!$A$3:$B$52,2,FALSE),0)","v":0},{"$f":"IF(Rang!I26>0,VLOOKUP(Rang!I26,Einstellungen!$A$3:$B$52,2,FALSE),0)","v":0},{"$f":"IF(Rang!J26>0,VLOOKUP(Rang!J26,Einstellungen!$A$3:$B$52,2,FALSE),0)","v":0},{"$f":"IF(Rang!K26>0,VLOOKUP(Rang!K26,Einstellungen!$A$3:$B$52,2,FALSE),0)","v":0},{"$f":"IF(Rang!L26>0,VLOOKUP(Rang!L26,Einstellungen!$A$3:$B$52,2,FALSE),0)","v":0},{"$f":"IF(Rang!M26>0,VLOOKUP(Rang!M26,Einstellungen!$A$3:$B$52,2,FALSE),0)","v":0},{"$f":"IF(Rang!N26>0,VLOOKUP(Rang!N26,Einstellungen!$A$3:$B$52,2,FALSE),0)","v":0},{"$f":"IF(Rang!O26>0,VLOOKUP(Rang!O26,Einstellungen!$A$3:$B$52,2,FALSE),0)","v":0},{"$f":"IF(Rang!P26>0,VLOOKUP(Rang!P26,Einstellungen!$A$3:$B$52,2,FALSE),0)","v":0},{"$f":"IF(Rang!Q26>0,VLOOKUP(Rang!Q26,Einstellungen!$A$3:$B$52,2,FALSE),0)","v":0},{"$f":"IF(Rang!R26>0,VLOOKUP(Rang!R26,Einstellungen!$A$3:$B$52,2,FALSE),0)","v":0},{"$f":"IF(Rang!S26>0,VLOOKUP(Rang!S26,Einstellungen!$A$3:$B$52,2,FALSE),0)","v":0},{"$f":"IF(Rang!T26>0,VLOOKUP(Rang!T26,Einstellungen!$A$3:$B$52,2,FALSE),0)","v":0},{"$f":"IF(Rang!U26>0,VLOOKUP(Rang!U26,Einstellungen!$A$3:$B$52,2,FALSE),0)","v":0},{"$f":"SUM(B26:U26)+IF($AY$4=2,AZ26,0)+IF($AY$4=3,BC26,0)","v":0},{"$f":"IF(SUM(B26:U26)>0,RANK(V26,$V$4:$V$53,0),0)","v":0},{"$f":"IF(SUM(B26:U26)>0,VLOOKUP(A26,TabRunden,22,FALSE),0)","v":0},{"$f":"AD26","v":0},{"$f":"IF(AD26>=$AT$2,LOOKUP($AL$2,$AE$3:$AX$3,AE26:AX26),0)+IF($AY$4=2,AZ26,0)+IF($AY$4=3,BC26,0)","v":0},{"$f":"IF(Z26>0,RANK(Z26,$Z$4:$Z$53,0),0)","v":0},{"$f":"IF(W26=0,51,W26)+IF(A26=\"\",50,0)","v":101},{"$f":"IF(AA26=0,51,AA26)+IF(A26=\"\",50,0)","v":101},0,0,{"$f":"LARGE($B26:$U26,AF$3)+AE26","v":0},0,0,0,0,0,0,0,0,0,0,0,0,0,0,0,0,0,0,null,0,0,0,{"$f":"IF(X26>0,VLOOKUP(A26,Rang!$A$4:$AU$53,47,FALSE))/1000","v":0}]
[{"$f":"IF(Runden!A27=\"\",\"\",Runden!A27)","v":""},{"$f":"IF(Rang!B27>0,VLOOKUP(Rang!B27,Einstellungen!$A$3:$B$52,2,FALSE),0)","v":0},{"$f":"IF(Rang!C27>0,VLOOKUP(Rang!C27,Einstellungen!$A$3:$B$52,2,FALSE),0)","v":0},{"$f":"IF(Rang!D27>0,VLOOKUP(Rang!D27,Einstellungen!$A$3:$B$52,2,FALSE),0)","v":0},{"$f":"IF(Rang!E27>0,VLOOKUP(Rang!E27,Einstellungen!$A$3:$B$52,2,FALSE),0)","v":0},{"$f":"IF(Rang!F27>0,VLOOKUP(Rang!F27,Einstellungen!$A$3:$B$52,2,FALSE),0)","v":0},{"$f":"IF(Rang!G27>0,VLOOKUP(Rang!G27,Einstellungen!$A$3:$B$52,2,FALSE),0)","v":0},{"$f":"IF(Rang!H27>0,VLOOKUP(Rang!H27,Einstellungen!$A$3:$B$52,2,FALSE),0)","v":0},{"$f":"IF(Rang!I27>0,VLOOKUP(Rang!I27,Einstellungen!$A$3:$B$52,2,FALSE),0)","v":0},{"$f":"IF(Rang!J27>0,VLOOKUP(Rang!J27,Einstellungen!$A$3:$B$52,2,FALSE),0)","v":0},{"$f":"IF(Rang!K27>0,VLOOKUP(Rang!K27,Einstellungen!$A$3:$B$52,2,FALSE),0)","v":0},{"$f":"IF(Rang!L27>0,VLOOKUP(Rang!L27,Einstellungen!$A$3:$B$52,2,FALSE),0)","v":0},{"$f":"IF(Rang!M27>0,VLOOKUP(Rang!M27,Einstellungen!$A$3:$B$52,2,FALSE),0)","v":0},{"$f":"IF(Rang!N27>0,VLOOKUP(Rang!N27,Einstellungen!$A$3:$B$52,2,FALSE),0)","v":0},{"$f":"IF(Rang!O27>0,VLOOKUP(Rang!O27,Einstellungen!$A$3:$B$52,2,FALSE),0)","v":0},{"$f":"IF(Rang!P27>0,VLOOKUP(Rang!P27,Einstellungen!$A$3:$B$52,2,FALSE),0)","v":0},{"$f":"IF(Rang!Q27>0,VLOOKUP(Rang!Q27,Einstellungen!$A$3:$B$52,2,FALSE),0)","v":0},{"$f":"IF(Rang!R27>0,VLOOKUP(Rang!R27,Einstellungen!$A$3:$B$52,2,FALSE),0)","v":0},{"$f":"IF(Rang!S27>0,VLOOKUP(Rang!S27,Einstellungen!$A$3:$B$52,2,FALSE),0)","v":0},{"$f":"IF(Rang!T27>0,VLOOKUP(Rang!T27,Einstellungen!$A$3:$B$52,2,FALSE),0)","v":0},{"$f":"IF(Rang!U27>0,VLOOKUP(Rang!U27,Einstellungen!$A$3:$B$52,2,FALSE),0)","v":0},{"$f":"SUM(B27:U27)+IF($AY$4=2,AZ27,0)+IF($AY$4=3,BC27,0)","v":0},{"$f":"IF(SUM(B27:U27)>0,RANK(V27,$V$4:$V$53,0),0)","v":0},{"$f":"IF(SUM(B27:U27)>0,VLOOKUP(A27,TabRunden,22,FALSE),0)","v":0},{"$f":"AD27","v":0},{"$f":"IF(AD27>=$AT$2,LOOKUP($AL$2,$AE$3:$AX$3,AE27:AX27),0)+IF($AY$4=2,AZ27,0)+IF($AY$4=3,BC27,0)","v":0},{"$f":"IF(Z27>0,RANK(Z27,$Z$4:$Z$53,0),0)","v":0},{"$f":"IF(W27=0,51,W27)+IF(A27=\"\",50,0)","v":101},{"$f":"IF(AA27=0,51,AA27)+IF(A27=\"\",50,0)","v":101},0,0,{"$f":"LARGE($B27:$U27,AF$3)+AE27","v":0},0,0,0,0,0,0,0,0,0,0,0,0,0,0,0,0,0,0,null,0,0,0,{"$f":"IF(X27>0,VLOOKUP(A27,Rang!$A$4:$AU$53,47,FALSE))/1000","v":0}]
[{"$f":"IF(Runden!A28=\"\",\"\",Runden!A28)","v":""},{"$f":"IF(Rang!B28>0,VLOOKUP(Rang!B28,Einstellungen!$A$3:$B$52,2,FALSE),0)","v":0},{"$f":"IF(Rang!C28>0,VLOOKUP(Rang!C28,Einstellungen!$A$3:$B$52,2,FALSE),0)","v":0},{"$f":"IF(Rang!D28>0,VLOOKUP(Rang!D28,Einstellungen!$A$3:$B$52,2,FALSE),0)","v":0},{"$f":"IF(Rang!E28>0,VLOOKUP(Rang!E28,Einstellungen!$A$3:$B$52,2,FALSE),0)","v":0},{"$f":"IF(Rang!F28>0,VLOOKUP(Rang!F28,Einstellungen!$A$3:$B$52,2,FALSE),0)","v":0},{"$f":"IF(Rang!G28>0,VLOOKUP(Rang!G28,Einstellungen!$A$3:$B$52,2,FALSE),0)","v":0},{"$f":"IF(Rang!H28>0,VLOOKUP(Rang!H28,Einstellungen!$A$3:$B$52,2,FALSE),0)","v":0},{"$f":"IF(Rang!I28>0,VLOOKUP(Rang!I28,Einstellungen!$A$3:$B$52,2,FALSE),0)","v":0},{"$f":"IF(Rang!J28>0,VLOOKUP(Rang!J28,Einstellungen!$A$3:$B$52,2,FALSE),0)","v":0},{"$f":"IF(Rang!K28>0,VLOOKUP(Rang!K28,Einstellungen!$A$3:$B$52,2,FALSE),0)","v":0},{"$f":"IF(Rang!L28>0,VLOOKUP(Rang!L28,Einstellungen!$A$3:$B$52,2,FALSE),0)","v":0},{"$f":"IF(Rang!M28>0,VLOOKUP(Rang!M28,Einstellungen!$A$3:$B$52,2,FALSE),0)","v":0},{"$f":"IF(Rang!N28>0,VLOOKUP(Rang!N28,Einstellungen!$A$3:$B$52,2,FALSE),0)","v":0},{"$f":"IF(Rang!O28>0,VLOOKUP(Rang!O28,Einstellungen!$A$3:$B$52,2,FALSE),0)","v":0},{"$f":"IF(Rang!P28>0,VLOOKUP(Rang!P28,Einstellungen!$A$3:$B$52,2,FALSE),0)","v":0},{"$f":"IF(Rang!Q28>0,VLOOKUP(Rang!Q28,Einstellungen!$A$3:$B$52,2,FALSE),0)","v":0},{"$f":"IF(Rang!R28>0,VLOOKUP(Rang!R28,Einstellungen!$A$3:$B$52,2,FALSE),0)","v":0},{"$f":"IF(Rang!S28>0,VLOOKUP(Rang!S28,Einstellungen!$A$3:$B$52,2,FALSE),0)","v":0},{"$f":"IF(Rang!T28>0,VLOOKUP(Rang!T28,Einstellungen!$A$3:$B$52,2,FALSE),0)","v":0},{"$f":"IF(Rang!U28>0,VLOOKUP(Rang!U28,Einstellungen!$A$3:$B$52,2,FALSE),0)","v":0},{"$f":"SUM(B28:U28)+IF($AY$4=2,AZ28,0)+IF($AY$4=3,BC28,0)","v":0},{"$f":"IF(SUM(B28:U28)>0,RANK(V28,$V$4:$V$53,0),0)","v":0},{"$f":"IF(SUM(B28:U28)>0,VLOOKUP(A28,TabRunden,22,FALSE),0)","v":0},{"$f":"AD28","v":0},{"$f":"IF(AD28>=$AT$2,LOOKUP($AL$2,$AE$3:$AX$3,AE28:AX28),0)+IF($AY$4=2,AZ28,0)+IF($AY$4=3,BC28,0)","v":0},{"$f":"IF(Z28>0,RANK(Z28,$Z$4:$Z$53,0),0)","v":0},{"$f":"IF(W28=0,51,W28)+IF(A28=\"\",50,0)","v":101},{"$f":"IF(AA28=0,51,AA28)+IF(A28=\"\",50,0)","v":101},0,0,{"$f":"LARGE($B28:$U28,AF$3)+AE28","v":0},0,0,0,0,0,0,0,0,0,0,0,0,0,0,0,0,0,0,null,0,0,0,{"$f":"IF(X28>0,VLOOKUP(A28,Rang!$A$4:$AU$53,47,FALSE))/1000","v":0}]
[{"$f":"IF(Runden!A29=\"\",\"\",Runden!A29)","v":""},{"$f":"IF(Rang!B29>0,VLOOKUP(Rang!B29,Einstellungen!$A$3:$B$52,2,FALSE),0)","v":0},{"$f":"IF(Rang!C29>0,VLOOKUP(Rang!C29,Einstellungen!$A$3:$B$52,2,FALSE),0)","v":0},{"$f":"IF(Rang!D29>0,VLOOKUP(Rang!D29,Einstellungen!$A$3:$B$52,2,FALSE),0)","v":0},{"$f":"IF(Rang!E29>0,VLOOKUP(Rang!E29,Einstellungen!$A$3:$B$52,2,FALSE),0)","v":0},{"$f":"IF(Rang!F29>0,VLOOKUP(Rang!F29,Einstellungen!$A$3:$B$52,2,FALSE),0)","v":0},{"$f":"IF(Rang!G29>0,VLOOKUP(Rang!G29,Einstellungen!$A$3:$B$52,2,FALSE),0)","v":0},{"$f":"IF(Rang!H29>0,VLOOKUP(Rang!H29,Einstellungen!$A$3:$B$52,2,FALSE),0)","v":0},{"$f":"IF(Rang!I29>0,VLOOKUP(Rang!I29,Einstellungen!$A$3:$B$52,2,FALSE),0)","v":0},{"$f":"IF(Rang!J29>0,VLOOKUP(Rang!J29,Einstellungen!$A$3:$B$52,2,FALSE),0)","v":0},{"$f":"IF(Rang!K29>0,VLOOKUP(Rang!K29,Einstellungen!$A$3:$B$52,2,FALSE),0)","v":0},{"$f":"IF(Rang!L29>0,VLOOKUP(Rang!L29,Einstellungen!$A$3:$B$52,2,FALSE),0)","v":0},{"$f":"IF(Rang!M29>0,VLOOKUP(Rang!M29,Einstellungen!$A$3:$B$52,2,FALSE),0)","v":0},{"$f":"IF(Rang!N29>0,VLOOKUP(Rang!N29,Einstellungen!$A$3:$B$52,2,FALSE),0)","v":0},{"$f":"IF(Rang!O29>0,VLOOKUP(Rang!O29,Einstellungen!$A$3:$B$52,2,FALSE),0)","v":0},{"$f":"IF(Rang!P29>0,VLOOKUP(Rang!P29,Einstellungen!$A$3:$B$52,2,FALSE),0)","v":0},{"$f":"IF(Rang!Q29>0,VLOOKUP(Rang!Q29,Einstellungen!$A$3:$B$52,2,FALSE),0)","v":0},{"$f":"IF(Rang!R29>0,VLOOKUP(Rang!R29,Einstellungen!$A$3:$B$52,2,FALSE),0)","v":0},{"$f":"IF(Rang!S29>0,VLOOKUP(Rang!S29,Einstellungen!$A$3:$B$52,2,FALSE),0)","v":0},{"$f":"IF(Rang!T29>0,VLOOKUP(Rang!T29,Einstellungen!$A$3:$B$52,2,FALSE),0)","v":0},{"$f":"IF(Rang!U29>0,VLOOKUP(Rang!U29,Einstellungen!$A$3:$B$52,2,FALSE),0)","v":0},{"$f":"SUM(B29:U29)+IF($AY$4=2,AZ29,0)+IF($AY$4=3,BC29,0)","v":0},{"$f":"IF(SUM(B29:U29)>0,RANK(V29,$V$4:$V$53,0),0)","v":0},{"$f":"IF(SUM(B29:U29)>0,VLOOKUP(A29,TabRunden,22,FALSE),0)","v":0},{"$f":"AD29","v":0},{"$f":"IF(AD29>=$AT$2,LOOKUP($AL$2,$AE$3:$AX$3,AE29:AX29),0)+IF($AY$4=2,AZ29,0)+IF($AY$4=3,BC29,0)","v":0},{"$f":"IF(Z29>0,RANK(Z29,$Z$4:$Z$53,0),0)","v":0},{"$f":"IF(W29=0,51,W29)+IF(A29=\"\",50,0)","v":101},{"$f":"IF(AA29=0,51,AA29)+IF(A29=\"\",50,0)","v":101},0,0,{"$f":"LARGE($B29:$U29,AF$3)+AE29","v":0},0,0,0,0,0,0,0,0,0,0,0,0,0,0,0,0,0,0,null,0,0,0,{"$f":"IF(X29>0,VLOOKUP(A29,Rang!$A$4:$AU$53,47,FALSE))/1000","v":0}]
[{"$f":"IF(Runden!A30=\"\",\"\",Runden!A30)","v":""},{"$f":"IF(Rang!B30>0,VLOOKUP(Rang!B30,Einstellungen!$A$3:$B$52,2,FALSE),0)","v":0},{"$f":"IF(Rang!C30>0,VLOOKUP(Rang!C30,Einstellungen!$A$3:$B$52,2,FALSE),0)","v":0},{"$f":"IF(Rang!D30>0,VLOOKUP(Rang!D30,Einstellungen!$A$3:$B$52,2,FALSE),0)","v":0},{"$f":"IF(Rang!E30>0,VLOOKUP(Rang!E30,Einstellungen!$A$3:$B$52,2,FALSE),0)","v":0},{"$f":"IF(Rang!F30>0,VLOOKUP(Rang!F30,Einstellungen!$A$3:$B$52,2,FALSE),0)","v":0},{"$f":"IF(Rang!G30>0,VLOOKUP(Rang!G30,Einstellungen!$A$3:$B$52,2,FALSE),0)","v":0},{"$f":"IF(Rang!H30>0,VLOOKUP(Rang!H30,Einstellungen!$A$3:$B$52,2,FALSE),0)","v":0},{"$f":"IF(Rang!I30>0,VLOOKUP(Rang!I30,Einstellungen!$A$3:$B$52,2,FALSE),0)","v":0},{"$f":"IF(Rang!J30>0,VLOOKUP(Rang!J30,Einstellungen!$A$3:$B$52,2,FALSE),0)","v":0},{"$f":"IF(Rang!K30>0,VLOOKUP(Rang!K30,Einstellungen!$A$3:$B$52,2,FALSE),0)","v":0},{"$f":"IF(Rang!L30>0,VLOOKUP(Rang!L30,Einstellungen!$A$3:$B$52,2,FALSE),0)","v":0},{"$f":"IF(Rang!M30>0,VLOOKUP(Rang!M30,Einstellungen!$A$3:$B$52,2,FALSE),0)","v":0},{"$f":"IF(Rang!N30>0,VLOOKUP(Rang!N30,Einstellungen!$A$3:$B$52,2,FALSE),0)","v":0},{"$f":"IF(Rang!O30>0,VLOOKUP(Rang!O30,Einstellungen!$A$3:$B$52,2,FALSE),0)","v":0},{"$f":"IF(Rang!P30>0,VLOOKUP(Rang!P30,Einstellungen!$A$3:$B$52,2,FALSE),0)","v":0},{"$f":"IF(Rang!Q30>0,VLOOKUP(Rang!Q30,Einstellungen!$A$3:$B$52,2,FALSE),0)","v":0},{"$f":"IF(Rang!R30>0,VLOOKUP(Rang!R30,Einstellungen!$A$3:$B$52,2,FALSE),0)","v":0},{"$f":"IF(Rang!S30>0,VLOOKUP(Rang!S30,Einstellungen!$A$3:$B$52,2,FALSE),0)","v":0},{"$f":"IF(Rang!T30>0,VLOOKUP(Rang!T30,Einstellungen!$A$3:$B$52,2,FALSE),0)","v":0},{"$f":"IF(Rang!U30>0,VLOOKUP(Rang!U30,Einstellungen!$A$3:$B$52,2,FALSE),0)","v":0},{"$f":"SUM(B30:U30)+IF($AY$4=2,AZ30,0)+IF($AY$4=3,BC30,0)","v":0},{"$f":"IF(SUM(B30:U30)>0,RANK(V30,$V$4:$V$53,0),0)","v":0},{"$f":"IF(SUM(B30:U30)>0,VLOOKUP(A30,TabRunden,22,FALSE),0)","v":0},{"$f":"AD30","v":0},{"$f":"IF(AD30>=$AT$2,LOOKUP($AL$2,$AE$3:$AX$3,AE30:AX30),0)+IF($AY$4=2,AZ30,0)+IF($AY$4=3,BC30,0)","v":0},{"$f":"IF(Z30>0,RANK(Z30,$Z$4:$Z$53,0),0)","v":0},{"$f":"IF(W30=0,51,W30)+IF(A30=\"\",50,0)","v":101},{"$f":"IF(AA30=0,51,AA30)+IF(A30=\"\",50,0)","v":101},0,0,{"$f":"LARGE($B30:$U30,AF$3)+AE30","v":0},0,0,0,0,0,0,0,0,0,0,0,0,0,0,0,0,0,0,null,0,0,0,{"$f":"IF(X30>0,VLOOKUP(A30,Rang!$A$4:$AU$53,47,FALSE))/1000","v":0}]
[{"$f":"IF(Runden!A31=\"\",\"\",Runden!A31)","v":""},{"$f":"IF(Rang!B31>0,VLOOKUP(Rang!B31,Einstellungen!$A$3:$B$52,2,FALSE),0)","v":0},{"$f":"IF(Rang!C31>0,VLOOKUP(Rang!C31,Einstellungen!$A$3:$B$52,2,FALSE),0)","v":0},{"$f":"IF(Rang!D31>0,VLOOKUP(Rang!D31,Einstellungen!$A$3:$B$52,2,FALSE),0)","v":0},{"$f":"IF(Rang!E31>0,VLOOKUP(Rang!E31,Einstellungen!$A$3:$B$52,2,FALSE),0)","v":0},{"$f":"IF(Rang!F31>0,VLOOKUP(Rang!F31,Einstellungen!$A$3:$B$52,2,FALSE),0)","v":0},{"$f":"IF(Rang!G31>0,VLOOKUP(Rang!G31,Einstellungen!$A$3:$B$52,2,FALSE),0)","v":0},{"$f":"IF(Rang!H31>0,VLOOKUP(Rang!H31,Einstellungen!$A$3:$B$52,2,FALSE),0)","v":0},{"$f":"IF(Rang!I31>0,VLOOKUP(Rang!I31,Einstellungen!$A$3:$B$52,2,FALSE),0)","v":0},{"$f":"IF(Rang!J31>0,VLOOKUP(Rang!J31,Einstellungen!$A$3:$B$52,2,FALSE),0)","v":0},{"$f":"IF(Rang!K31>0,VLOOKUP(Rang!K31,Einstellungen!$A$3:$B$52,2,FALSE),0)","v":0},{"$f":"IF(Rang!L31>0,VLOOKUP(Rang!L31,Einstellungen!$A$3:$B$52,2,FALSE),0)","v":0},{"$f":"IF(Rang!M31>0,VLOOKUP(Rang!M31,Einstellungen!$A$3:$B$52,2,FALSE),0)","v":0},{"$f":"IF(Rang!N31>0,VLOOKUP(Rang!N31,Einstellungen!$A$3:$B$52,2,FALSE),0)","v":0},{"$f":"IF(Rang!O31>0,VLOOKUP(Rang!O31,Einstellungen!$A$3:$B$52,2,FALSE),0)","v":0},{"$f":"IF(Rang!P31>0,VLOOKUP(Rang!P31,Einstellungen!$A$3:$B$52,2,FALSE),0)","v":0},{"$f":"IF(Rang!Q31>0,VLOOKUP(Rang!Q31,Einstellungen!$A$3:$B$52,2,FALSE),0)","v":0},{"$f":"IF(Rang!R31>0,VLOOKUP(Rang!R31,Einstellungen!$A$3:$B$52,2,FALSE),0)","v":0},{"$f":"IF(Rang!S31>0,VLOOKUP(Rang!S31,Einstellungen!$A$3:$B$52,2,FALSE),0)","v":0},{"$f":"IF(Rang!T31>0,VLOOKUP(Rang!T31,Einstellungen!$A$3:$B$52,2,FALSE),0)","v":0},{"$f":"IF(Rang!U31>0,VLOOKUP(Rang!U31,Einstellungen!$A$3:$B$52,2,FALSE),0)","v":0},{"$f":"SUM(B31:U31)+IF($AY$4=2,AZ31,0)+IF($AY$4=3,BC31,0)","v":0},{"$f":"IF(SUM(B31:U31)>0,RANK(V31,$V$4:$V$53,0),0)","v":0},{"$f":"IF(SUM(B31:U31)>0,VLOOKUP(A31,TabRunden,22,FALSE),0)","v":0},{"$f":"AD31","v":0},{"$f":"IF(AD31>=$AT$2,LOOKUP($AL$2,$AE$3:$AX$3,AE31:AX31),0)+IF($AY$4=2,AZ31,0)+IF($AY$4=3,BC31,0)","v":0},{"$f":"IF(Z31>0,RANK(Z31,$Z$4:$Z$53,0),0)","v":0},{"$f":"IF(W31=0,51,W31)+IF(A31=\"\",50,0)","v":101},{"$f":"IF(AA31=0,51,AA31)+IF(A31=\"\",50,0)","v":101},0,0,{"$f":"LARGE($B31:$U31,AF$3)+AE31","v":0},0,0,0,0,0,0,0,0,0,0,0,0,0,0,0,0,0,0,null,0,0,0,{"$f":"IF(X31>0,VLOOKUP(A31,Rang!$A$4:$AU$53,47,FALSE))/1000","v":0}]
[{"$f":"IF(Runden!A32=\"\",\"\",Runden!A32)","v":""},{"$f":"IF(Rang!B32>0,VLOOKUP(Rang!B32,Einstellungen!$A$3:$B$52,2,FALSE),0)","v":0},{"$f":"IF(Rang!C32>0,VLOOKUP(Rang!C32,Einstellungen!$A$3:$B$52,2,FALSE),0)","v":0},{"$f":"IF(Rang!D32>0,VLOOKUP(Rang!D32,Einstellungen!$A$3:$B$52,2,FALSE),0)","v":0},{"$f":"IF(Rang!E32>0,VLOOKUP(Rang!E32,Einstellungen!$A$3:$B$52,2,FALSE),0)","v":0},{"$f":"IF(Rang!F32>0,VLOOKUP(Rang!F32,Einstellungen!$A$3:$B$52,2,FALSE),0)","v":0},{"$f":"IF(Rang!G32>0,VLOOKUP(Rang!G32,Einstellungen!$A$3:$B$52,2,FALSE),0)","v":0},{"$f":"IF(Rang!H32>0,VLOOKUP(Rang!H32,Einstellungen!$A$3:$B$52,2,FALSE),0)","v":0},{"$f":"IF(Rang!I32>0,VLOOKUP(Rang!I32,Einstellungen!$A$3:$B$52,2,FALSE),0)","v":0},{"$f":"IF(Rang!J32>0,VLOOKUP(Rang!J32,Einstellungen!$A$3:$B$52,2,FALSE),0)","v":0},{"$f":"IF(Rang!K32>0,VLOOKUP(Rang!K32,Einstellungen!$A$3:$B$52,2,FALSE),0)","v":0},{"$f":"IF(Rang!L32>0,VLOOKUP(Rang!L32,Einstellungen!$A$3:$B$52,2,FALSE),0)","v":0},{"$f":"IF(Rang!M32>0,VLOOKUP(Rang!M32,Einstellungen!$A$3:$B$52,2,FALSE),0)","v":0},{"$f":"IF(Rang!N32>0,VLOOKUP(Rang!N32,Einstellungen!$A$3:$B$52,2,FALSE),0)","v":0},{"$f":"IF(Rang!O32>0,VLOOKUP(Rang!O32,Einstellungen!$A$3:$B$52,2,FALSE),0)","v":0},{"$f":"IF(Rang!P32>0,VLOOKUP(Rang!P32,Einstellungen!$A$3:$B$52,2,FALSE),0)","v":0},{"$f":"IF(Rang!Q32>0,VLOOKUP(Rang!Q32,Einstellungen!$A$3:$B$52,2,FALSE),0)","v":0},{"$f":"IF(Rang!R32>0,VLOOKUP(Rang!R32,Einstellungen!$A$3:$B$52,2,FALSE),0)","v":0},{"$f":"IF(Rang!S32>0,VLOOKUP(Rang!S32,Einstellungen!$A$3:$B$52,2,FALSE),0)","v":0},{"$f":"IF(Rang!T32>0,VLOOKUP(Rang!T32,Einstellungen!$A$3:$B$52,2,FALSE),0)","v":0},{"$f":"IF(Rang!U32>0,VLOOKUP(Rang!U32,Einstellungen!$A$3:$B$52,2,FALSE),0)","v":0},{"$f":"SUM(B32:U32)+IF($AY$4=2,AZ32,0)+IF($AY$4=3,BC32,0)","v":0},{"$f":"IF(SUM(B32:U32)>0,RANK(V32,$V$4:$V$53,0),0)","v":0},{"$f":"IF(SUM(B32:U32)>0,VLOOKUP(A32,TabRunden,22,FALSE),0)","v":0},{"$f":"AD32","v":0},{"$f":"IF(AD32>=$AT$2,LOOKUP($AL$2,$AE$3:$AX$3,AE32:AX32),0)+IF($AY$4=2,AZ32,0)+IF($AY$4=3,BC32,0)","v":0},{"$f":"IF(Z32>0,RANK(Z32,$Z$4:$Z$53,0),0)","v":0},{"$f":"IF(W32=0,51,W32)+IF(A32=\"\",50,0)","v":101},{"$f":"IF(AA32=0,51,AA32)+IF(A32=\"\",50,0)","v":101},0,0,{"$f":"LARGE($B32:$U32,AF$3)+AE32","v":0},0,0,0,0,0,0,0,0,0,0,0,0,0,0,0,0,0,0,null,0,0,0,{"$f":"IF(X32>0,VLOOKUP(A32,Rang!$A$4:$AU$53,47,FALSE))/1000","v":0}]
[{"$f":"IF(Runden!A33=\"\",\"\",Runden!A33)","v":""},{"$f":"IF(Rang!B33>0,VLOOKUP(Rang!B33,Einstellungen!$A$3:$B$52,2,FALSE),0)","v":0},{"$f":"IF(Rang!C33>0,VLOOKUP(Rang!C33,Einstellungen!$A$3:$B$52,2,FALSE),0)","v":0},{"$f":"IF(Rang!D33>0,VLOOKUP(Rang!D33,Einstellungen!$A$3:$B$52,2,FALSE),0)","v":0},{"$f":"IF(Rang!E33>0,VLOOKUP(Rang!E33,Einstellungen!$A$3:$B$52,2,FALSE),0)","v":0},{"$f":"IF(Rang!F33>0,VLOOKUP(Rang!F33,Einstellungen!$A$3:$B$52,2,FALSE),0)","v":0},{"$f":"IF(Rang!G33>0,VLOOKUP(Rang!G33,Einstellungen!$A$3:$B$52,2,FALSE),0)","v":0},{"$f":"IF(Rang!H33>0,VLOOKUP(Rang!H33,Einstellungen!$A$3:$B$52,2,FALSE),0)","v":0},{"$f":"IF(Rang!I33>0,VLOOKUP(Rang!I33,Einstellungen!$A$3:$B$52,2,FALSE),0)","v":0},{"$f":"IF(Rang!J33>0,VLOOKUP(Rang!J33,Einstellungen!$A$3:$B$52,2,FALSE),0)","v":0},{"$f":"IF(Rang!K33>0,VLOOKUP(Rang!K33,Einstellungen!$A$3:$B$52,2,FALSE),0)","v":0},{"$f":"IF(Rang!L33>0,VLOOKUP(Rang!L33,Einstellungen!$A$3:$B$52,2,FALSE),0)","v":0},{"$f":"IF(Rang!M33>0,VLOOKUP(Rang!M33,Einstellungen!$A$3:$B$52,2,FALSE),0)","v":0},{"$f":"IF(Rang!N33>0,VLOOKUP(Rang!N33,Einstellungen!$A$3:$B$52,2,FALSE),0)","v":0},{"$f":"IF(Rang!O33>0,VLOOKUP(Rang!O33,Einstellungen!$A$3:$B$52,2,FALSE),0)","v":0},{"$f":"IF(Rang!P33>0,VLOOKUP(Rang!P33,Einstellungen!$A$3:$B$52,2,FALSE),0)","v":0},{"$f":"IF(Rang!Q33>0,VLOOKUP(Rang!Q33,Einstellungen!$A$3:$B$52,2,FALSE),0)","v":0},{"$f":"IF(Rang!R33>0,VLOOKUP(Rang!R33,Einstellungen!$A$3:$B$52,2,FALSE),0)","v":0},{"$f":"IF(Rang!S33>0,VLOOKUP(Rang!S33,Einstellungen!$A$3:$B$52,2,FALSE),0)","v":0},{"$f":"IF(Rang!T33>0,VLOOKUP(Rang!T33,Einstellungen!$A$3:$B$52,2,FALSE),0)","v":0},{"$f":"IF(Rang!U33>0,VLOOKUP(Rang!U33,Einstellungen!$A$3:$B$52,2,FALSE),0)","v":0},{"$f":"SUM(B33:U33)+IF($AY$4=2,AZ33,0)+IF($AY$4=3,BC33,0)","v":0},{"$f":"IF(SUM(B33:U33)>0,RANK(V33,$V$4:$V$53,0),0)","v":0},{"$f":"IF(SUM(B33:U33)>0,VLOOKUP(A33,TabRunden,22,FALSE),0)","v":0},{"$f":"AD33","v":0},{"$f":"IF(AD33>=$AT$2,LOOKUP($AL$2,$AE$3:$AX$3,AE33:AX33),0)+IF($AY$4=2,AZ33,0)+IF($AY$4=3,BC33,0)","v":0},{"$f":"IF(Z33>0,RANK(Z33,$Z$4:$Z$53,0),0)","v":0},{"$f":"IF(W33=0,51,W33)+IF(A33=\"\",50,0)","v":101},{"$f":"IF(AA33=0,51,AA33)+IF(A33=\"\",50,0)","v":101},0,0,{"$f":"LARGE($B33:$U33,AF$3)+AE33","v":0},0,0,0,0,0,0,0,0,0,0,0,0,0,0,0,0,0,0,null,0,0,0,{"$f":"IF(X33>0,VLOOKUP(A33,Rang!$A$4:$AU$53,47,FALSE))/1000","v":0}]
[{"$f":"IF(Runden!A34=\"\",\"\",Runden!A34)","v":""},{"$f":"IF(Rang!B34>0,VLOOKUP(Rang!B34,Einstellungen!$A$3:$B$52,2,FALSE),0)","v":0},{"$f":"IF(Rang!C34>0,VLOOKUP(Rang!C34,Einstellungen!$A$3:$B$52,2,FALSE),0)","v":0},{"$f":"IF(Rang!D34>0,VLOOKUP(Rang!D34,Einstellungen!$A$3:$B$52,2,FALSE),0)","v":0},{"$f":"IF(Rang!E34>0,VLOOKUP(Rang!E34,Einstellungen!$A$3:$B$52,2,FALSE),0)","v":0},{"$f":"IF(Rang!F34>0,VLOOKUP(Rang!F34,Einstellungen!$A$3:$B$52,2,FALSE),0)","v":0},{"$f":"IF(Rang!G34>0,VLOOKUP(Rang!G34,Einstellungen!$A$3:$B$52,2,FALSE),0)","v":0},{"$f":"IF(Rang!H34>0,VLOOKUP(Rang!H34,Einstellungen!$A$3:$B$52,2,FALSE),0)","v":0},{"$f":"IF(Rang!I34>0,VLOOKUP(Rang!I34,Einstellungen!$A$3:$B$52,2,FALSE),0)","v":0},{"$f":"IF(Rang!J34>0,VLOOKUP(Rang!J34,Einstellungen!$A$3:$B$52,2,FALSE),0)","v":0},{"$f":"IF(Rang!K34>0,VLOOKUP(Rang!K34,Einstellungen!$A$3:$B$52,2,FALSE),0)","v":0},{"$f":"IF(Rang!L34>0,VLOOKUP(Rang!L34,Einstellungen!$A$3:$B$52,2,FALSE),0)","v":0},{"$f":"IF(Rang!M34>0,VLOOKUP(Rang!M34,Einstellungen!$A$3:$B$52,2,FALSE),0)","v":0},{"$f":"IF(Rang!N34>0,VLOOKUP(Rang!N34,Einstellungen!$A$3:$B$52,2,FALSE),0)","v":0},{"$f":"IF(Rang!O34>0,VLOOKUP(Rang!O34,Einstellungen!$A$3:$B$52,2,FALSE),0)","v":0},{"$f":"IF(Rang!P34>0,VLOOKUP(Rang!P34,Einstellungen!$A$3:$B$52,2,FALSE),0)","v":0},{"$f":"IF(Rang!Q34>0,VLOOKUP(Rang!Q34,Einstellungen!$A$3:$B$52,2,FALSE),0)","v":0},{"$f":"IF(Rang!R34>0,VLOOKUP(Rang!R34,Einstellungen!$A$3:$B$52,2,FALSE),0)","v":0},{"$f":"IF(Rang!S34>0,VLOOKUP(Rang!S34,Einstellungen!$A$3:$B$52,2,FALSE),0)","v":0},{"$f":"IF(Rang!T34>0,VLOOKUP(Rang!T34,Einstellungen!$A$3:$B$52,2,FALSE),0)","v":0},{"$f":"IF(Rang!U34>0,VLOOKUP(Rang!U34,Einstellungen!$A$3:$B$52,2,FALSE),0)","v":0},{"$f":"SUM(B34:U34)+IF($AY$4=2,AZ34,0)+IF($AY$4=3,BC34,0)","v":0},{"$f":"IF(SUM(B34:U34)>0,RANK(V34,$V$4:$V$53,0),0)","v":0},{"$f":"IF(SUM(B34:U34)>0,VLOOKUP(A34,TabRunden,22,FALSE),0)","v":0},{"$f":"AD34","v":0},{"$f":"IF(AD34>=$AT$2,LOOKUP($AL$2,$AE$3:$AX$3,AE34:AX34),0)+IF($AY$4=2,AZ34,0)+IF($AY$4=3,BC34,0)","v":0},{"$f":"IF(Z34>0,RANK(Z34,$Z$4:$Z$53,0),0)","v":0},{"$f":"IF(W34=0,51,W34)+IF(A34=\"\",50,0)","v":101},{"$f":"IF(AA34=0,51,AA34)+IF(A34=\"\",50,0)","v":101},0,0,{"$f":"LARGE($B34:$U34,AF$3)+AE34","v":0},0,0,0,0,0,0,0,0,0,0,0,0,0,0,0,0,0,0,null,0,0,0,{"$f":"IF(X34>0,VLOOKUP(A34,Rang!$A$4:$AU$53,47,FALSE))/1000","v":0}]
[{"$f":"IF(Runden!A35=\"\",\"\",Runden!A35)","v":""},{"$f":"IF(Rang!B35>0,VLOOKUP(Rang!B35,Einstellungen!$A$3:$B$52,2,FALSE),0)","v":0},{"$f":"IF(Rang!C35>0,VLOOKUP(Rang!C35,Einstellungen!$A$3:$B$52,2,FALSE),0)","v":0},{"$f":"IF(Rang!D35>0,VLOOKUP(Rang!D35,Einstellungen!$A$3:$B$52,2,FALSE),0)","v":0},{"$f":"IF(Rang!E35>0,VLOOKUP(Rang!E35,Einstellungen!$A$3:$B$52,2,FALSE),0)","v":0},{"$f":"IF(Rang!F35>0,VLOOKUP(Rang!F35,Einstellungen!$A$3:$B$52,2,FALSE),0)","v":0},{"$f":"IF(Rang!G35>0,VLOOKUP(Rang!G35,Einstellungen!$A$3:$B$52,2,FALSE),0)","v":0},{"$f":"IF(Rang!H35>0,VLOOKUP(Rang!H35,Einstellungen!$A$3:$B$52,2,FALSE),0)","v":0},{"$f":"IF(Rang!I35>0,VLOOKUP(Rang!I35,Einstellungen!$A$3:$B$52,2,FALSE),0)","v":0},{"$f":"IF(Rang!J35>0,VLOOKUP(Rang!J35,Einstellungen!$A$3:$B$52,2,FALSE),0)","v":0},{"$f":"IF(Rang!K35>0,VLOOKUP(Rang!K35,Einstellungen!$A$3:$B$52,2,FALSE),0)","v":0},{"$f":"IF(Rang!L35>0,VLOOKUP(Rang!L35,Einstellungen!$A$3:$B$52,2,FALSE),0)","v":0},{"$f":"IF(Rang!M35>0,VLOOKUP(Rang!M35,Einstellungen!$A$3:$B$52,2,FALSE),0)","v":0},{"$f":"IF(Rang!N35>0,VLOOKUP(Rang!N35,Einstellungen!$A$3:$B$52,2,FALSE),0)","v":0},{"$f":"IF(Rang!O35>0,VLOOKUP(Rang!O35,Einstellungen!$A$3:$B$52,2,FALSE),0)","v":0},{"$f":"IF(Rang!P35>0,VLOOKUP(Rang!P35,Einstellungen!$A$3:$B$52,2,FALSE),0)","v":0},{"$f":"IF(Rang!Q35>0,VLOOKUP(Rang!Q35,Einstellungen!$A$3:$B$52,2,FALSE),0)","v":0},{"$f":"IF(Rang!R35>0,VLOOKUP(Rang!R35,Einstellungen!$A$3:$B$52,2,FALSE),0)","v":0},{"$f":"IF(Rang!S35>0,VLOOKUP(Rang!S35,Einstellungen!$A$3:$B$52,2,FALSE),0)","v":0},{"$f":"IF(Rang!T35>0,VLOOKUP(Rang!T35,Einstellungen!$A$3:$B$52,2,FALSE),0)","v":0},{"$f":"IF(Rang!U35>0,VLOOKUP(Rang!U35,Einstellungen!$A$3:$B$52,2,FALSE),0)","v":0},{"$f":"SUM(B35:U35)+IF($AY$4=2,AZ35,0)+IF($AY$4=3,BC35,0)","v":0},{"$f":"IF(SUM(B35:U35)>0,RANK(V35,$V$4:$V$53,0),0)","v":0},{"$f":"IF(SUM(B35:U35)>0,VLOOKUP(A35,TabRunden,22,FALSE),0)","v":0},{"$f":"AD35","v":0},{"$f":"IF(AD35>=$AT$2,LOOKUP($AL$2,$AE$3:$AX$3,AE35:AX35),0)+IF($AY$4=2,AZ35,0)+IF($AY$4=3,BC35,0)","v":0},{"$f":"IF(Z35>0,RANK(Z35,$Z$4:$Z$53,0),0)","v":0},{"$f":"IF(W35=0,51,W35)+IF(A35=\"\",50,0)","v":101},{"$f":"IF(AA35=0,51,AA35)+IF(A35=\"\",50,0)","v":101},0,0,{"$f":"LARGE($B35:$U35,AF$3)+AE35","v":0},0,0,0,0,0,0,0,0,0,0,0,0,0,0,0,0,0,0,null,0,0,0,{"$f":"IF(X35>0,VLOOKUP(A35,Rang!$A$4:$AU$53,47,FALSE))/1000","v":0}]
[{"$f":"IF(Runden!A36=\"\",\"\",Runden!A36)","v":""},{"$f":"IF(Rang!B36>0,VLOOKUP(Rang!B36,Einstellungen!$A$3:$B$52,2,FALSE),0)","v":0},{"$f":"IF(Rang!C36>0,VLOOKUP(Rang!C36,Einstellungen!$A$3:$B$52,2,FALSE),0)","v":0},{"$f":"IF(Rang!D36>0,VLOOKUP(Rang!D36,Einstellungen!$A$3:$B$52,2,FALSE),0)","v":0},{"$f":"IF(Rang!E36>0,VLOOKUP(Rang!E36,Einstellungen!$A$3:$B$52,2,FALSE),0)","v":0},{"$f":"IF(Rang!F36>0,VLOOKUP(Rang!F36,Einstellungen!$A$3:$B$52,2,FALSE),0)","v":0},{"$f":"IF(Rang!G36>0,VLOOKUP(Rang!G36,Einstellungen!$A$3:$B$52,2,FALSE),0)","v":0},{"$f":"IF(Rang!H36>0,VLOOKUP(Rang!H36,Einstellungen!$A$3:$B$52,2,FALSE),0)","v":0},{"$f":"IF(Rang!I36>0,VLOOKUP(Rang!I36,Einstellungen!$A$3:$B$52,2,FALSE),0)","v":0},{"$f":"IF(Rang!J36>0,VLOOKUP(Rang!J36,Einstellungen!$A$3:$B$52,2,FALSE),0)","v":0},{"$f":"IF(Rang!K36>0,VLOOKUP(Rang!K36,Einstellungen!$A$3:$B$52,2,FALSE),0)","v":0},{"$f":"IF(Rang!L36>0,VLOOKUP(Rang!L36,Einstellungen!$A$3:$B$52,2,FALSE),0)","v":0},{"$f":"IF(Rang!M36>0,VLOOKUP(Rang!M36,Einstellungen!$A$3:$B$52,2,FALSE),0)","v":0},{"$f":"IF(Rang!N36>0,VLOOKUP(Rang!N36,Einstellungen!$A$3:$B$52,2,FALSE),0)","v":0},{"$f":"IF(Rang!O36>0,VLOOKUP(Rang!O36,Einstellungen!$A$3:$B$52,2,FALSE),0)","v":0},{"$f":"IF(Rang!P36>0,VLOOKUP(Rang!P36,Einstellungen!$A$3:$B$52,2,FALSE),0)","v":0},{"$f":"IF(Rang!Q36>0,VLOOKUP(Rang!Q36,Einstellungen!$A$3:$B$52,2,FALSE),0)","v":0},{"$f":"IF(Rang!R36>0,VLOOKUP(Rang!R36,Einstellungen!$A$3:$B$52,2,FALSE),0)","v":0},{"$f":"IF(Rang!S36>0,VLOOKUP(Rang!S36,Einstellungen!$A$3:$B$52,2,FALSE),0)","v":0},{"$f":"IF(Rang!T36>0,VLOOKUP(Rang!T36,Einstellungen!$A$3:$B$52,2,FALSE),0)","v":0},{"$f":"IF(Rang!U36>0,VLOOKUP(Rang!U36,Einstellungen!$A$3:$B$52,2,FALSE),0)","v":0},{"$f":"SUM(B36:U36)+IF($AY$4=2,AZ36,0)+IF($AY$4=3,BC36,0)","v":0},{"$f":"IF(SUM(B36:U36)>0,RANK(V36,$V$4:$V$53,0),0)","v":0},{"$f":"IF(SUM(B36:U36)>0,VLOOKUP(A36,TabRunden,22,FALSE),0)","v":0},{"$f":"AD36","v":0},{"$f":"IF(AD36>=$AT$2,LOOKUP($AL$2,$AE$3:$AX$3,AE36:AX36),0)+IF($AY$4=2,AZ36,0)+IF($AY$4=3,BC36,0)","v":0},{"$f":"IF(Z36>0,RANK(Z36,$Z$4:$Z$53,0),0)","v":0},{"$f":"IF(W36=0,51,W36)+IF(A36=\"\",50,0)","v":101},{"$f":"IF(AA36=0,51,AA36)+IF(A36=\"\",50,0)","v":101},{"$f":"20-COUNTIF(B36:U36,0)","v":0},{"$f":"LARGE($B36:$U36,AE$3)","v":0},{"$f":"LARGE($B36:$U36,AF$3)+AE36","v":0},0,0,0,0,0,0,0,0,0,0,0,0,0,0,0,0,0,0,null,0,0,0,{"$f":"IF(X36>0,VLOOKUP(A36,Rang!$A$4:$AU$53,47,FALSE))/1000","v":0}]
[{"$f":"IF(Runden!A37=\"\",\"\",Runden!A37)","v":""},{"$f":"IF(Rang!B37>0,VLOOKUP(Rang!B37,Einstellungen!$A$3:$B$52,2,FALSE),0)","v":0},{"$f":"IF(Rang!C37>0,VLOOKUP(Rang!C37,Einstellungen!$A$3:$B$52,2,FALSE),0)","v":0},{"$f":"IF(Rang!D37>0,VLOOKUP(Rang!D37,Einstellungen!$A$3:$B$52,2,FALSE),0)","v":0},{"$f":"IF(Rang!E37>0,VLOOKUP(Rang!E37,Einstellungen!$A$3:$B$52,2,FALSE),0)","v":0},{"$f":"IF(Rang!F37>0,VLOOKUP(Rang!F37,Einstellungen!$A$3:$B$52,2,FALSE),0)","v":0},{"$f":"IF(Rang!G37>0,VLOOKUP(Rang!G37,Einstellungen!$A$3:$B$52,2,FALSE),0)","v":0},{"$f":"IF(Rang!H37>0,VLOOKUP(Rang!H37,Einstellungen!$A$3:$B$52,2,FALSE),0)","v":0},{"$f":"IF(Rang!I37>0,VLOOKUP(Rang!I37,Einstellungen!$A$3:$B$52,2,FALSE),0)","v":0},{"$f":"IF(Rang!J37>0,VLOOKUP(Rang!J37,Einstellungen!$A$3:$B$52,2,FALSE),0)","v":0},{"$f":"IF(Rang!K37>0,VLOOKUP(Rang!K37,Einstellungen!$A$3:$B$52,2,FALSE),0)","v":0},{"$f":"IF(Rang!L37>0,VLOOKUP(Rang!L37,Einstellungen!$A$3:$B$52,2,FALSE),0)","v":0},{"$f":"IF(Rang!M37>0,VLOOKUP(Rang!M37,Einstellungen!$A$3:$B$52,2,FALSE),0)","v":0},{"$f":"IF(Rang!N37>0,VLOOKUP(Rang!N37,Einstellungen!$A$3:$B$52,2,FALSE),0)","v":0},{"$f":"IF(Rang!O37>0,VLOOKUP(Rang!O37,Einstellungen!$A$3:$B$52,2,FALSE),0)","v":0},{"$f":"IF(Rang!P37>0,VLOOKUP(Rang!P37,Einstellungen!$A$3:$B$52,2,FALSE),0)","v":0},{"$f":"IF(Rang!Q37>0,VLOOKUP(Rang!Q37,Einstellungen!$A$3:$B$52,2,FALSE),0)","v":0},{"$f":"IF(Rang!R37>0,VLOOKUP(Rang!R37,Einstellungen!$A$3:$B$52,2,FALSE),0)","v":0},{"$f":"IF(Rang!S37>0,VLOOKUP(Rang!S37,Einstellungen!$A$3:$B$52,2,FALSE),0)","v":0},{"$f":"IF(Rang!T37>0,VLOOKUP(Rang!T37,Einstellungen!$A$3:$B$52,2,FALSE),0)","v":0},{"$f":"IF(Rang!U37>0,VLOOKUP(Rang!U37,Einstellungen!$A$3:$B$52,2,FALSE),0)","v":0},{"$f":"SUM(B37:U37)+IF($AY$4=2,AZ37,0)+IF($AY$4=3,BC37,0)","v":0},{"$f":"IF(SUM(B37:U37)>0,RANK(V37,$V$4:$V$53,0),0)","v":0},{"$f":"IF(SUM(B37:U37)>0,VLOOKUP(A37,TabRunden,22,FALSE),0)","v":0},{"$f":"AD37","v":0},{"$f":"IF(AD37>=$AT$2,LOOKUP($AL$2,$AE$3:$AX$3,AE37:AX37),0)+IF($AY$4=2,AZ37,0)+IF($AY$4=3,BC37,0)","v":0},{"$f":"IF(Z37>0,RANK(Z37,$Z$4:$Z$53,0),0)","v":0},{"$f":"IF(W37=0,51,W37)+IF(A37=\"\",50,0)","v":101},{"$f":"IF(AA37=0,51,AA37)+IF(A37=\"\",50,0)","v":101},0,0,{"$f":"LARGE($B37:$U37,AF$3)+AE37","v":0},0,0,0,0,0,0,0,0,0,0,0,0,0,0,0,0,0,0,null,0,0,0,{"$f":"IF(X37>0,VLOOKUP(A37,Rang!$A$4:$AU$53,47,FALSE))/1000","v":0}]
[{"$f":"IF(Runden!A38=\"\",\"\",Runden!A38)","v":""},{"$f":"IF(Rang!B38>0,VLOOKUP(Rang!B38,Einstellungen!$A$3:$B$52,2,FALSE),0)","v":0},{"$f":"IF(Rang!C38>0,VLOOKUP(Rang!C38,Einstellungen!$A$3:$B$52,2,FALSE),0)","v":0},{"$f":"IF(Rang!D38>0,VLOOKUP(Rang!D38,Einstellungen!$A$3:$B$52,2,FALSE),0)","v":0},{"$f":"IF(Rang!E38>0,VLOOKUP(Rang!E38,Einstellungen!$A$3:$B$52,2,FALSE),0)","v":0},{"$f":"IF(Rang!F38>0,VLOOKUP(Rang!F38,Einstellungen!$A$3:$B$52,2,FALSE),0)","v":0},{"$f":"IF(Rang!G38>0,VLOOKUP(Rang!G38,Einstellungen!$A$3:$B$52,2,FALSE),0)","v":0},{"$f":"IF(Rang!H38>0,VLOOKUP(Rang!H38,Einstellungen!$A$3:$B$52,2,FALSE),0)","v":0},{"$f":"IF(Rang!I38>0,VLOOKUP(Rang!I38,Einstellungen!$A$3:$B$52,2,FALSE),0)","v":0},{"$f":"IF(Rang!J38>0,VLOOKUP(Rang!J38,Einstellungen!$A$3:$B$52,2,FALSE),0)","v":0},{"$f":"IF(Rang!K38>0,VLOOKUP(Rang!K38,Einstellungen!$A$3:$B$52,2,FALSE),0)","v":0},{"$f":"IF(Rang!L38>0,VLOOKUP(Rang!L38,Einstellungen!$A$3:$B$52,2,FALSE),0)","v":0},{"$f":"IF(Rang!M38>0,VLOOKUP(Rang!M38,Einstellungen!$A$3:$B$52,2,FALSE),0)","v":0},{"$f":"IF(Rang!N38>0,VLOOKUP(Rang!N38,Einstellungen!$A$3:$B$52,2,FALSE),0)","v":0},{"$f":"IF(Rang!O38>0,VLOOKUP(Rang!O38,Einstellungen!$A$3:$B$52,2,FALSE),0)","v":0},{"$f":"IF(Rang!P38>0,VLOOKUP(Rang!P38,Einstellungen!$A$3:$B$52,2,FALSE),0)","v":0},{"$f":"IF(Rang!Q38>0,VLOOKUP(Rang!Q38,Einstellungen!$A$3:$B$52,2,FALSE),0)","v":0},{"$f":"IF(Rang!R38>0,VLOOKUP(Rang!R38,Einstellungen!$A$3:$B$52,2,FALSE),0)","v":0},{"$f":"IF(Rang!S38>0,VLOOKUP(Rang!S38,Einstellungen!$A$3:$B$52,2,FALSE),0)","v":0},{"$f":"IF(Rang!T38>0,VLOOKUP(Rang!T38,Einstellungen!$A$3:$B$52,2,FALSE),0)","v":0},{"$f":"IF(Rang!U38>0,VLOOKUP(Rang!U38,Einstellungen!$A$3:$B$52,2,FALSE),0)","v":0},{"$f":"SUM(B38:U38)+IF($AY$4=2,AZ38,0)+IF($AY$4=3,BC38,0)","v":0},{"$f":"IF(SUM(B38:U38)>0,RANK(V38,$V$4:$V$53,0),0)","v":0},{"$f":"IF(SUM(B38:U38)>0,VLOOKUP(A38,TabRunden,22,FALSE),0)","v":0},{"$f":"AD38","v":0},{"$f":"IF(AD38>=$AT$2,LOOKUP($AL$2,$AE$3:$AX$3,AE38:AX38),0)+IF($AY$4=2,AZ38,0)+IF($AY$4=3,BC38,0)","v":0},{"$f":"IF(Z38>0,RANK(Z38,$Z$4:$Z$53,0),0)","v":0},{"$f":"IF(W38=0,51,W38)+IF(A38=\"\",50,0)","v":101},{"$f":"IF(AA38=0,51,AA38)+IF(A38=\"\",50,0)","v":101},0,0,{"$f":"LARGE($B38:$U38,AF$3)+AE38","v":0},0,0,0,0,0,0,0,0,0,0,0,0,0,0,0,0,0,0,null,0,0,0,{"$f":"IF(X38>0,VLOOKUP(A38,Rang!$A$4:$AU$53,47,FALSE))/1000","v":0}]
[{"$f":"IF(Runden!A39=\"\",\"\",Runden!A39)","v":""},{"$f":"IF(Rang!B39>0,VLOOKUP(Rang!B39,Einstellungen!$A$3:$B$52,2,FALSE),0)","v":0},{"$f":"IF(Rang!C39>0,VLOOKUP(Rang!C39,Einstellungen!$A$3:$B$52,2,FALSE),0)","v":0},{"$f":"IF(Rang!D39>0,VLOOKUP(Rang!D39,Einstellungen!$A$3:$B$52,2,FALSE),0)","v":0},{"$f":"IF(Rang!E39>0,VLOOKUP(Rang!E39,Einstellungen!$A$3:$B$52,2,FALSE),0)","v":0},{"$f":"IF(Rang!F39>0,VLOOKUP(Rang!F39,Einstellungen!$A$3:$B$52,2,FALSE),0)","v":0},{"$f":"IF(Rang!G39>0,VLOOKUP(Rang!G39,Einstellungen!$A$3:$B$52,2,FALSE),0)","v":0},{"$f":"IF(Rang!H39>0,VLOOKUP(Rang!H39,Einstellungen!$A$3:$B$52,2,FALSE),0)","v":0},{"$f":"IF(Rang!I39>0,VLOOKUP(Rang!I39,Einstellungen!$A$3:$B$52,2,FALSE),0)","v":0},{"$f":"IF(Rang!J39>0,VLOOKUP(Rang!J39,Einstellungen!$A$3:$B$52,2,FALSE),0)","v":0},{"$f":"IF(Rang!K39>0,VLOOKUP(Rang!K39,Einstellungen!$A$3:$B$52,2,FALSE),0)","v":0},{"$f":"IF(Rang!L39>0,VLOOKUP(Rang!L39,Einstellungen!$A$3:$B$52,2,FALSE),0)","v":0},{"$f":"IF(Rang!M39>0,VLOOKUP(Rang!M39,Einstellungen!$A$3:$B$52,2,FALSE),0)","v":0},{"$f":"IF(Rang!N39>0,VLOOKUP(Rang!N39,Einstellungen!$A$3:$B$52,2,FALSE),0)","v":0},{"$f":"IF(Rang!O39>0,VLOOKUP(Rang!O39,Einstellungen!$A$3:$B$52,2,FALSE),0)","v":0},{"$f":"IF(Rang!P39>0,VLOOKUP(Rang!P39,Einstellungen!$A$3:$B$52,2,FALSE),0)","v":0},{"$f":"IF(Rang!Q39>0,VLOOKUP(Rang!Q39,Einstellungen!$A$3:$B$52,2,FALSE),0)","v":0},{"$f":"IF(Rang!R39>0,VLOOKUP(Rang!R39,Einstellungen!$A$3:$B$52,2,FALSE),0)","v":0},{"$f":"IF(Rang!S39>0,VLOOKUP(Rang!S39,Einstellungen!$A$3:$B$52,2,FALSE),0)","v":0},{"$f":"IF(Rang!T39>0,VLOOKUP(Rang!T39,Einstellungen!$A$3:$B$52,2,FALSE),0)","v":0},{"$f":"IF(Rang!U39>0,VLOOKUP(Rang!U39,Einstellungen!$A$3:$B$52,2,FALSE),0)","v":0},{"$f":"SUM(B39:U39)+IF($AY$4=2,AZ39,0)+IF($AY$4=3,BC39,0)","v":0},{"$f":"IF(SUM(B39:U39)>0,RANK(V39,$V$4:$V$53,0),0)","v":0},{"$f":"IF(SUM(B39:U39)>0,VLOOKUP(A39,TabRunden,22,FALSE),0)","v":0},{"$f":"AD39","v":0},{"$f":"IF(AD39>=$AT$2,LOOKUP($AL$2,$AE$3:$AX$3,AE39:AX39),0)+IF($AY$4=2,AZ39,0)+IF($AY$4=3,BC39,0)","v":0},{"$f":"IF(Z39>0,RANK(Z39,$Z$4:$Z$53,0),0)","v":0},{"$f":"IF(W39=0,51,W39)+IF(A39=\"\",50,0)","v":101},{"$f":"IF(AA39=0,51,AA39)+IF(A39=\"\",50,0)","v":101},0,0,{"$f":"LARGE($B39:$U39,AF$3)+AE39","v":0},0,0,0,0,0,0,0,0,0,0,0,0,0,0,0,0,0,0,null,0,0,0,{"$f":"IF(X39>0,VLOOKUP(A39,Rang!$A$4:$AU$53,47,FALSE))/1000","v":0}]
[{"$f":"IF(Runden!A40=\"\",\"\",Runden!A40)","v":""},{"$f":"IF(Rang!B40>0,VLOOKUP(Rang!B40,Einstellungen!$A$3:$B$52,2,FALSE),0)","v":0},{"$f":"IF(Rang!C40>0,VLOOKUP(Rang!C40,Einstellungen!$A$3:$B$52,2,FALSE),0)","v":0},{"$f":"IF(Rang!D40>0,VLOOKUP(Rang!D40,Einstellungen!$A$3:$B$52,2,FALSE),0)","v":0},{"$f":"IF(Rang!E40>0,VLOOKUP(Rang!E40,Einstellungen!$A$3:$B$52,2,FALSE),0)","v":0},{"$f":"IF(Rang!F40>0,VLOOKUP(Rang!F40,Einstellungen!$A$3:$B$52,2,FALSE),0)","v":0},{"$f":"IF(Rang!G40>0,VLOOKUP(Rang!G40,Einstellungen!$A$3:$B$52,2,FALSE),0)","v":0},{"$f":"IF(Rang!H40>0,VLOOKUP(Rang!H40,Einstellungen!$A$3:$B$52,2,FALSE),0)","v":0},{"$f":"IF(Rang!I40>0,VLOOKUP(Rang!I40,Einstellungen!$A$3:$B$52,2,FALSE),0)","v":0},{"$f":"IF(Rang!J40>0,VLOOKUP(Rang!J40,Einstellungen!$A$3:$B$52,2,FALSE),0)","v":0},{"$f":"IF(Rang!K40>0,VLOOKUP(Rang!K40,Einstellungen!$A$3:$B$52,2,FALSE),0)","v":0},{"$f":"IF(Rang!L40>0,VLOOKUP(Rang!L40,Einstellungen!$A$3:$B$52,2,FALSE),0)","v":0},{"$f":"IF(Rang!M40>0,VLOOKUP(Rang!M40,Einstellungen!$A$3:$B$52,2,FALSE),0)","v":0},{"$f":"IF(Rang!N40>0,VLOOKUP(Rang!N40,Einstellungen!$A$3:$B$52,2,FALSE),0)","v":0},{"$f":"IF(Rang!O40>0,VLOOKUP(Rang!O40,Einstellungen!$A$3:$B$52,2,FALSE),0)","v":0},{"$f":"IF(Rang!P40>0,VLOOKUP(Rang!P40,Einstellungen!$A$3:$B$52,2,FALSE),0)","v":0},{"$f":"IF(Rang!Q40>0,VLOOKUP(Rang!Q40,Einstellungen!$A$3:$B$52,2,FALSE),0)","v":0},{"$f":"IF(Rang!R40>0,VLOOKUP(Rang!R40,Einstellungen!$A$3:$B$52,2,FALSE),0)","v":0},{"$f":"IF(Rang!S40>0,VLOOKUP(Rang!S40,Einstellungen!$A$3:$B$52,2,FALSE),0)","v":0},{"$f":"IF(Rang!T40>0,VLOOKUP(Rang!T40,Einstellungen!$A$3:$B$52,2,FALSE),0)","v":0},{"$f":"IF(Rang!U40>0,VLOOKUP(Rang!U40,Einstellungen!$A$3:$B$52,2,FALSE),0)","v":0},{"$f":"SUM(B40:U40)+IF($AY$4=2,AZ40,0)+IF($AY$4=3,BC40,0)","v":0},{"$f":"IF(SUM(B40:U40)>0,RANK(V40,$V$4:$V$53,0),0)","v":0},{"$f":"IF(SUM(B40:U40)>0,VLOOKUP(A40,TabRunden,22,FALSE),0)","v":0},{"$f":"AD40","v":0},{"$f":"IF(AD40>=$AT$2,LOOKUP($AL$2,$AE$3:$AX$3,AE40:AX40),0)+IF($AY$4=2,AZ40,0)+IF($AY$4=3,BC40,0)","v":0},{"$f":"IF(Z40>0,RANK(Z40,$Z$4:$Z$53,0),0)","v":0},{"$f":"IF(W40=0,51,W40)+IF(A40=\"\",50,0)","v":101},{"$f":"IF(AA40=0,51,AA40)+IF(A40=\"\",50,0)","v":101},0,0,{"$f":"LARGE($B40:$U40,AF$3)+AE40","v":0},0,0,0,0,0,0,0,0,0,0,0,0,0,0,0,0,0,0,null,0,0,0,{"$f":"IF(X40>0,VLOOKUP(A40,Rang!$A$4:$AU$53,47,FALSE))/1000","v":0}]
[{"$f":"IF(Runden!A41=\"\",\"\",Runden!A41)","v":""},{"$f":"IF(Rang!B41>0,VLOOKUP(Rang!B41,Einstellungen!$A$3:$B$52,2,FALSE),0)","v":0},{"$f":"IF(Rang!C41>0,VLOOKUP(Rang!C41,Einstellungen!$A$3:$B$52,2,FALSE),0)","v":0},{"$f":"IF(Rang!D41>0,VLOOKUP(Rang!D41,Einstellungen!$A$3:$B$52,2,FALSE),0)","v":0},{"$f":"IF(Rang!E41>0,VLOOKUP(Rang!E41,Einstellungen!$A$3:$B$52,2,FALSE),0)","v":0},{"$f":"IF(Rang!F41>0,VLOOKUP(Rang!F41,Einstellungen!$A$3:$B$52,2,FALSE),0)","v":0},{"$f":"IF(Rang!G41>0,VLOOKUP(Rang!G41,Einstellungen!$A$3:$B$52,2,FALSE),0)","v":0},{"$f":"IF(Rang!H41>0,VLOOKUP(Rang!H41,Einstellungen!$A$3:$B$52,2,FALSE),0)","v":0},{"$f":"IF(Rang!I41>0,VLOOKUP(Rang!I41,Einstellungen!$A$3:$B$52,2,FALSE),0)","v":0},{"$f":"IF(Rang!J41>0,VLOOKUP(Rang!J41,Einstellungen!$A$3:$B$52,2,FALSE),0)","v":0},{"$f":"IF(Rang!K41>0,VLOOKUP(Rang!K41,Einstellungen!$A$3:$B$52,2,FALSE),0)","v":0},{"$f":"IF(Rang!L41>0,VLOOKUP(Rang!L41,Einstellungen!$A$3:$B$52,2,FALSE),0)","v":0},{"$f":"IF(Rang!M41>0,VLOOKUP(Rang!M41,Einstellungen!$A$3:$B$52,2,FALSE),0)","v":0},{"$f":"IF(Rang!N41>0,VLOOKUP(Rang!N41,Einstellungen!$A$3:$B$52,2,FALSE),0)","v":0},{"$f":"IF(Rang!O41>0,VLOOKUP(Rang!O41,Einstellungen!$A$3:$B$52,2,FALSE),0)","v":0},{"$f":"IF(Rang!P41>0,VLOOKUP(Rang!P41,Einstellungen!$A$3:$B$52,2,FALSE),0)","v":0},{"$f":"IF(Rang!Q41>0,VLOOKUP(Rang!Q41,Einstellungen!$A$3:$B$52,2,FALSE),0)","v":0},{"$f":"IF(Rang!R41>0,VLOOKUP(Rang!R41,Einstellungen!$A$3:$B$52,2,FALSE),0)","v":0},{"$f":"IF(Rang!S41>0,VLOOKUP(Rang!S41,Einstellungen!$A$3:$B$52,2,FALSE),0)","v":0},{"$f":"IF(Rang!T41>0,VLOOKUP(Rang!T41,Einstellungen!$A$3:$B$52,2,FALSE),0)","v":0},{"$f":"IF(Rang!U41>0,VLOOKUP(Rang!U41,Einstellungen!$A$3:$B$52,2,FALSE),0)","v":0},{"$f":"SUM(B41:U41)+IF($AY$4=2,AZ41,0)+IF($AY$4=3,BC41,0)","v":0},{"$f":"IF(SUM(B41:U41)>0,RANK(V41,$V$4:$V$53,0),0)","v":0},{"$f":"IF(SUM(B41:U41)>0,VLOOKUP(A41,TabRunden,22,FALSE),0)","v":0},{"$f":"AD41","v":0},{"$f":"IF(AD41>=$AT$2,LOOKUP($AL$2,$AE$3:$AX$3,AE41:AX41),0)+IF($AY$4=2,AZ41,0)+IF($AY$4=3,BC41,0)","v":0},{"$f":"IF(Z41>0,RANK(Z41,$Z$4:$Z$53,0),0)","v":0},{"$f":"IF(W41=0,51,W41)+IF(A41=\"\",50,0)","v":101},{"$f":"IF(AA41=0,51,AA41)+IF(A41=\"\",50,0)","v":101},0,0,{"$f":"LARGE($B41:$U41,AF$3)+AE41","v":0},0,0,0,0,0,0,0,0,0,0,0,0,0,0,0,0,0,0,null,0,0,0,{"$f":"IF(X41>0,VLOOKUP(A41,Rang!$A$4:$AU$53,47,FALSE))/1000","v":0}]
[{"$f":"IF(Runden!A42=\"\",\"\",Runden!A42)","v":""},{"$f":"IF(Rang!B42>0,VLOOKUP(Rang!B42,Einstellungen!$A$3:$B$52,2,FALSE),0)","v":0},{"$f":"IF(Rang!C42>0,VLOOKUP(Rang!C42,Einstellungen!$A$3:$B$52,2,FALSE),0)","v":0},{"$f":"IF(Rang!D42>0,VLOOKUP(Rang!D42,Einstellungen!$A$3:$B$52,2,FALSE),0)","v":0},{"$f":"IF(Rang!E42>0,VLOOKUP(Rang!E42,Einstellungen!$A$3:$B$52,2,FALSE),0)","v":0},{"$f":"IF(Rang!F42>0,VLOOKUP(Rang!F42,Einstellungen!$A$3:$B$52,2,FALSE),0)","v":0},{"$f":"IF(Rang!G42>0,VLOOKUP(Rang!G42,Einstellungen!$A$3:$B$52,2,FALSE),0)","v":0},{"$f":"IF(Rang!H42>0,VLOOKUP(Rang!H42,Einstellungen!$A$3:$B$52,2,FALSE),0)","v":0},{"$f":"IF(Rang!I42>0,VLOOKUP(Rang!I42,Einstellungen!$A$3:$B$52,2,FALSE),0)","v":0},{"$f":"IF(Rang!J42>0,VLOOKUP(Rang!J42,Einstellungen!$A$3:$B$52,2,FALSE),0)","v":0},{"$f":"IF(Rang!K42>0,VLOOKUP(Rang!K42,Einstellungen!$A$3:$B$52,2,FALSE),0)","v":0},{"$f":"IF(Rang!L42>0,VLOOKUP(Rang!L42,Einstellungen!$A$3:$B$52,2,FALSE),0)","v":0},{"$f":"IF(Rang!M42>0,VLOOKUP(Rang!M42,Einstellungen!$A$3:$B$52,2,FALSE),0)","v":0},{"$f":"IF(Rang!N42>0,VLOOKUP(Rang!N42,Einstellungen!$A$3:$B$52,2,FALSE),0)","v":0},{"$f":"IF(Rang!O42>0,VLOOKUP(Rang!O42,Einstellungen!$A$3:$B$52,2,FALSE),0)","v":0},{"$f":"IF(Rang!P42>0,VLOOKUP(Rang!P42,Einstellungen!$A$3:$B$52,2,FALSE),0)","v":0},{"$f":"IF(Rang!Q42>0,VLOOKUP(Rang!Q42,Einstellungen!$A$3:$B$52,2,FALSE),0)","v":0},{"$f":"IF(Rang!R42>0,VLOOKUP(Rang!R42,Einstellungen!$A$3:$B$52,2,FALSE),0)","v":0},{"$f":"IF(Rang!S42>0,VLOOKUP(Rang!S42,Einstellungen!$A$3:$B$52,2,FALSE),0)","v":0},{"$f":"IF(Rang!T42>0,VLOOKUP(Rang!T42,Einstellungen!$A$3:$B$52,2,FALSE),0)","v":0},{"$f":"IF(Rang!U42>0,VLOOKUP(Rang!U42,Einstellungen!$A$3:$B$52,2,FALSE),0)","v":0},{"$f":"SUM(B42:U42)+IF($AY$4=2,AZ42,0)+IF($AY$4=3,BC42,0)","v":0},{"$f":"IF(SUM(B42:U42)>0,RANK(V42,$V$4:$V$53,0),0)","v":0},{"$f":"IF(SUM(B42:U42)>0,VLOOKUP(A42,TabRunden,22,FALSE),0)","v":0},{"$f":"AD42","v":0},{"$f":"IF(AD42>=$AT$2,LOOKUP($AL$2,$AE$3:$AX$3,AE42:AX42),0)+IF($AY$4=2,AZ42,0)+IF($AY$4=3,BC42,0)","v":0},{"$f":"IF(Z42>0,RANK(Z42,$Z$4:$Z$53,0),0)","v":0},{"$f":"IF(W42=0,51,W42)+IF(A42=\"\",50,0)","v":101},{"$f":"IF(AA42=0,51,AA42)+IF(A42=\"\",50,0)","v":101},0,0,{"$f":"LARGE($B42:$U42,AF$3)+AE42","v":0},0,0,0,0,0,0,0,0,0,0,0,0,0,0,0,0,0,0,null,0,0,0,{"$f":"IF(X42>0,VLOOKUP(A42,Rang!$A$4:$AU$53,47,FALSE))/1000","v":0}]
[{"$f":"IF(Runden!A43=\"\",\"\",Runden!A43)","v":""},{"$f":"IF(Rang!B43>0,VLOOKUP(Rang!B43,Einstellungen!$A$3:$B$52,2,FALSE),0)","v":0},{"$f":"IF(Rang!C43>0,VLOOKUP(Rang!C43,Einstellungen!$A$3:$B$52,2,FALSE),0)","v":0},{"$f":"IF(Rang!D43>0,VLOOKUP(Rang!D43,Einstellungen!$A$3:$B$52,2,FALSE),0)","v":0},{"$f":"IF(Rang!E43>0,VLOOKUP(Rang!E43,Einstellungen!$A$3:$B$52,2,FALSE),0)","v":0},{"$f":"IF(Rang!F43>0,VLOOKUP(Rang!F43,Einstellungen!$A$3:$B$52,2,FALSE),0)","v":0},{"$f":"IF(Rang!G43>0,VLOOKUP(Rang!G43,Einstellungen!$A$3:$B$52,2,FALSE),0)","v":0},{"$f":"IF(Rang!H43>0,VLOOKUP(Rang!H43,Einstellungen!$A$3:$B$52,2,FALSE),0)","v":0},{"$f":"IF(Rang!I43>0,VLOOKUP(Rang!I43,Einstellungen!$A$3:$B$52,2,FALSE),0)","v":0},{"$f":"IF(Rang!J43>0,VLOOKUP(Rang!J43,Einstellungen!$A$3:$B$52,2,FALSE),0)","v":0},{"$f":"IF(Rang!K43>0,VLOOKUP(Rang!K43,Einstellungen!$A$3:$B$52,2,FALSE),0)","v":0},{"$f":"IF(Rang!L43>0,VLOOKUP(Rang!L43,Einstellungen!$A$3:$B$52,2,FALSE),0)","v":0},{"$f":"IF(Rang!M43>0,VLOOKUP(Rang!M43,Einstellungen!$A$3:$B$52,2,FALSE),0)","v":0},{"$f":"IF(Rang!N43>0,VLOOKUP(Rang!N43,Einstellungen!$A$3:$B$52,2,FALSE),0)","v":0},{"$f":"IF(Rang!O43>0,VLOOKUP(Rang!O43,Einstellungen!$A$3:$B$52,2,FALSE),0)","v":0},{"$f":"IF(Rang!P43>0,VLOOKUP(Rang!P43,Einstellungen!$A$3:$B$52,2,FALSE),0)","v":0},{"$f":"IF(Rang!Q43>0,VLOOKUP(Rang!Q43,Einstellungen!$A$3:$B$52,2,FALSE),0)","v":0},{"$f":"IF(Rang!R43>0,VLOOKUP(Rang!R43,Einstellungen!$A$3:$B$52,2,FALSE),0)","v":0},{"$f":"IF(Rang!S43>0,VLOOKUP(Rang!S43,Einstellungen!$A$3:$B$52,2,FALSE),0)","v":0},{"$f":"IF(Rang!T43>0,VLOOKUP(Rang!T43,Einstellungen!$A$3:$B$52,2,FALSE),0)","v":0},{"$f":"IF(Rang!U43>0,VLOOKUP(Rang!U43,Einstellungen!$A$3:$B$52,2,FALSE),0)","v":0},{"$f":"SUM(B43:U43)+IF($AY$4=2,AZ43,0)+IF($AY$4=3,BC43,0)","v":0},{"$f":"IF(SUM(B43:U43)>0,RANK(V43,$V$4:$V$53,0),0)","v":0},{"$f":"IF(SUM(B43:U43)>0,VLOOKUP(A43,TabRunden,22,FALSE),0)","v":0},{"$f":"AD43","v":0},{"$f":"IF(AD43>=$AT$2,LOOKUP($AL$2,$AE$3:$AX$3,AE43:AX43),0)+IF($AY$4=2,AZ43,0)+IF($AY$4=3,BC43,0)","v":0},{"$f":"IF(Z43>0,RANK(Z43,$Z$4:$Z$53,0),0)","v":0},{"$f":"IF(W43=0,51,W43)+IF(A43=\"\",50,0)","v":101},{"$f":"IF(AA43=0,51,AA43)+IF(A43=\"\",50,0)","v":101},0,0,{"$f":"LARGE($B43:$U43,AF$3)+AE43","v":0},0,0,0,0,0,0,0,0,0,0,0,0,0,0,0,0,0,0,null,0,0,0,{"$f":"IF(X43>0,VLOOKUP(A43,Rang!$A$4:$AU$53,47,FALSE))/1000","v":0}]
[{"$f":"IF(Runden!A44=\"\",\"\",Runden!A44)","v":""},{"$f":"IF(Rang!B44>0,VLOOKUP(Rang!B44,Einstellungen!$A$3:$B$52,2,FALSE),0)","v":0},{"$f":"IF(Rang!C44>0,VLOOKUP(Rang!C44,Einstellungen!$A$3:$B$52,2,FALSE),0)","v":0},{"$f":"IF(Rang!D44>0,VLOOKUP(Rang!D44,Einstellungen!$A$3:$B$52,2,FALSE),0)","v":0},{"$f":"IF(Rang!E44>0,VLOOKUP(Rang!E44,Einstellungen!$A$3:$B$52,2,FALSE),0)","v":0},{"$f":"IF(Rang!F44>0,VLOOKUP(Rang!F44,Einstellungen!$A$3:$B$52,2,FALSE),0)","v":0},{"$f":"IF(Rang!G44>0,VLOOKUP(Rang!G44,Einstellungen!$A$3:$B$52,2,FALSE),0)","v":0},{"$f":"IF(Rang!H44>0,VLOOKUP(Rang!H44,Einstellungen!$A$3:$B$52,2,FALSE),0)","v":0},{"$f":"IF(Rang!I44>0,VLOOKUP(Rang!I44,Einstellungen!$A$3:$B$52,2,FALSE),0)","v":0},{"$f":"IF(Rang!J44>0,VLOOKUP(Rang!J44,Einstellungen!$A$3:$B$52,2,FALSE),0)","v":0},{"$f":"IF(Rang!K44>0,VLOOKUP(Rang!K44,Einstellungen!$A$3:$B$52,2,FALSE),0)","v":0},{"$f":"IF(Rang!L44>0,VLOOKUP(Rang!L44,Einstellungen!$A$3:$B$52,2,FALSE),0)","v":0},{"$f":"IF(Rang!M44>0,VLOOKUP(Rang!M44,Einstellungen!$A$3:$B$52,2,FALSE),0)","v":0},{"$f":"IF(Rang!N44>0,VLOOKUP(Rang!N44,Einstellungen!$A$3:$B$52,2,FALSE),0)","v":0},{"$f":"IF(Rang!O44>0,VLOOKUP(Rang!O44,Einstellungen!$A$3:$B$52,2,FALSE),0)","v":0},{"$f":"IF(Rang!P44>0,VLOOKUP(Rang!P44,Einstellungen!$A$3:$B$52,2,FALSE),0)","v":0},{"$f":"IF(Rang!Q44>0,VLOOKUP(Rang!Q44,Einstellungen!$A$3:$B$52,2,FALSE),0)","v":0},{"$f":"IF(Rang!R44>0,VLOOKUP(Rang!R44,Einstellungen!$A$3:$B$52,2,FALSE),0)","v":0},{"$f":"IF(Rang!S44>0,VLOOKUP(Rang!S44,Einstellungen!$A$3:$B$52,2,FALSE),0)","v":0},{"$f":"IF(Rang!T44>0,VLOOKUP(Rang!T44,Einstellungen!$A$3:$B$52,2,FALSE),0)","v":0},{"$f":"IF(Rang!U44>0,VLOOKUP(Rang!U44,Einstellungen!$A$3:$B$52,2,FALSE),0)","v":0},{"$f":"SUM(B44:U44)+IF($AY$4=2,AZ44,0)+IF($AY$4=3,BC44,0)","v":0},{"$f":"IF(SUM(B44:U44)>0,RANK(V44,$V$4:$V$53,0),0)","v":0},{"$f":"IF(SUM(B44:U44)>0,VLOOKUP(A44,TabRunden,22,FALSE),0)","v":0},{"$f":"AD44","v":0},{"$f":"IF(AD44>=$AT$2,LOOKUP($AL$2,$AE$3:$AX$3,AE44:AX44),0)+IF($AY$4=2,AZ44,0)+IF($AY$4=3,BC44,0)","v":0},{"$f":"IF(Z44>0,RANK(Z44,$Z$4:$Z$53,0),0)","v":0},{"$f":"IF(W44=0,51,W44)+IF(A44=\"\",50,0)","v":101},{"$f":"IF(AA44=0,51,AA44)+IF(A44=\"\",50,0)","v":101},0,0,{"$f":"LARGE($B44:$U44,AF$3)+AE44","v":0},0,0,0,0,0,0,0,0,0,0,0,0,0,0,0,0,0,0,null,0,0,0,{"$f":"IF(X44>0,VLOOKUP(A44,Rang!$A$4:$AU$53,47,FALSE))/1000","v":0}]
[{"$f":"IF(Runden!A45=\"\",\"\",Runden!A45)","v":""},{"$f":"IF(Rang!B45>0,VLOOKUP(Rang!B45,Einstellungen!$A$3:$B$52,2,FALSE),0)","v":0},{"$f":"IF(Rang!C45>0,VLOOKUP(Rang!C45,Einstellungen!$A$3:$B$52,2,FALSE),0)","v":0},{"$f":"IF(Rang!D45>0,VLOOKUP(Rang!D45,Einstellungen!$A$3:$B$52,2,FALSE),0)","v":0},{"$f":"IF(Rang!E45>0,VLOOKUP(Rang!E45,Einstellungen!$A$3:$B$52,2,FALSE),0)","v":0},{"$f":"IF(Rang!F45>0,VLOOKUP(Rang!F45,Einstellungen!$A$3:$B$52,2,FALSE),0)","v":0},{"$f":"IF(Rang!G45>0,VLOOKUP(Rang!G45,Einstellungen!$A$3:$B$52,2,FALSE),0)","v":0},{"$f":"IF(Rang!H45>0,VLOOKUP(Rang!H45,Einstellungen!$A$3:$B$52,2,FALSE),0)","v":0},{"$f":"IF(Rang!I45>0,VLOOKUP(Rang!I45,Einstellungen!$A$3:$B$52,2,FALSE),0)","v":0},{"$f":"IF(Rang!J45>0,VLOOKUP(Rang!J45,Einstellungen!$A$3:$B$52,2,FALSE),0)","v":0},{"$f":"IF(Rang!K45>0,VLOOKUP(Rang!K45,Einstellungen!$A$3:$B$52,2,FALSE),0)","v":0},{"$f":"IF(Rang!L45>0,VLOOKUP(Rang!L45,Einstellungen!$A$3:$B$52,2,FALSE),0)","v":0},{"$f":"IF(Rang!M45>0,VLOOKUP(Rang!M45,Einstellungen!$A$3:$B$52,2,FALSE),0)","v":0},{"$f":"IF(Rang!N45>0,VLOOKUP(Rang!N45,Einstellungen!$A$3:$B$52,2,FALSE),0)","v":0},{"$f":"IF(Rang!O45>0,VLOOKUP(Rang!O45,Einstellungen!$A$3:$B$52,2,FALSE),0)","v":0},{"$f":"IF(Rang!P45>0,VLOOKUP(Rang!P45,Einstellungen!$A$3:$B$52,2,FALSE),0)","v":0},{"$f":"IF(Rang!Q45>0,VLOOKUP(Rang!Q45,Einstellungen!$A$3:$B$52,2,FALSE),0)","v":0},{"$f":"IF(Rang!R45>0,VLOOKUP(Rang!R45,Einstellungen!$A$3:$B$52,2,FALSE),0)","v":0},{"$f":"IF(Rang!S45>0,VLOOKUP(Rang!S45,Einstellungen!$A$3:$B$52,2,FALSE),0)","v":0},{"$f":"IF(Rang!T45>0,VLOOKUP(Rang!T45,Einstellungen!$A$3:$B$52,2,FALSE),0)","v":0},{"$f":"IF(Rang!U45>0,VLOOKUP(Rang!U45,Einstellungen!$A$3:$B$52,2,FALSE),0)","v":0},{"$f":"SUM(B45:U45)+IF($AY$4=2,AZ45,0)+IF($AY$4=3,BC45,0)","v":0},{"$f":"IF(SUM(B45:U45)>0,RANK(V45,$V$4:$V$53,0),0)","v":0},{"$f":"IF(SUM(B45:U45)>0,VLOOKUP(A45,TabRunden,22,FALSE),0)","v":0},{"$f":"AD45","v":0},{"$f":"IF(AD45>=$AT$2,LOOKUP($AL$2,$AE$3:$AX$3,AE45:AX45),0)+IF($AY$4=2,AZ45,0)+IF($AY$4=3,BC45,0)","v":0},{"$f":"IF(Z45>0,RANK(Z45,$Z$4:$Z$53,0),0)","v":0},{"$f":"IF(W45=0,51,W45)+IF(A45=\"\",50,0)","v":101},{"$f":"IF(AA45=0,51,AA45)+IF(A45=\"\",50,0)","v":101},0,0,{"$f":"LARGE($B45:$U45,AF$3)+AE45","v":0},0,0,0,0,0,0,0,0,0,0,0,0,0,0,0,0,0,0,null,0,0,0,{"$f":"IF(X45>0,VLOOKUP(A45,Rang!$A$4:$AU$53,47,FALSE))/1000","v":0}]
[{"$f":"IF(Runden!A46=\"\",\"\",Runden!A46)","v":""},{"$f":"IF(Rang!B46>0,VLOOKUP(Rang!B46,Einstellungen!$A$3:$B$52,2,FALSE),0)","v":0},{"$f":"IF(Rang!C46>0,VLOOKUP(Rang!C46,Einstellungen!$A$3:$B$52,2,FALSE),0)","v":0},{"$f":"IF(Rang!D46>0,VLOOKUP(Rang!D46,Einstellungen!$A$3:$B$52,2,FALSE),0)","v":0},{"$f":"IF(Rang!E46>0,VLOOKUP(Rang!E46,Einstellungen!$A$3:$B$52,2,FALSE),0)","v":0},{"$f":"IF(Rang!F46>0,VLOOKUP(Rang!F46,Einstellungen!$A$3:$B$52,2,FALSE),0)","v":0},{"$f":"IF(Rang!G46>0,VLOOKUP(Rang!G46,Einstellungen!$A$3:$B$52,2,FALSE),0)","v":0},{"$f":"IF(Rang!H46>0,VLOOKUP(Rang!H46,Einstellungen!$A$3:$B$52,2,FALSE),0)","v":0},{"$f":"IF(Rang!I46>0,VLOOKUP(Rang!I46,Einstellungen!$A$3:$B$52,2,FALSE),0)","v":0},{"$f":"IF(Rang!J46>0,VLOOKUP(Rang!J46,Einstellungen!$A$3:$B$52,2,FALSE),0)","v":0},{"$f":"IF(Rang!K46>0,VLOOKUP(Rang!K46,Einstellungen!$A$3:$B$52,2,FALSE),0)","v":0},{"$f":"IF(Rang!L46>0,VLOOKUP(Rang!L46,Einstellungen!$A$3:$B$52,2,FALSE),0)","v":0},{"$f":"IF(Rang!M46>0,VLOOKUP(Rang!M46,Einstellungen!$A$3:$B$52,2,FALSE),0)","v":0},{"$f":"IF(Rang!N46>0,VLOOKUP(Rang!N46,Einstellungen!$A$3:$B$52,2,FALSE),0)","v":0},{"$f":"IF(Rang!O46>0,VLOOKUP(Rang!O46,Einstellungen!$A$3:$B$52,2,FALSE),0)","v":0},{"$f":"IF(Rang!P46>0,VLOOKUP(Rang!P46,Einstellungen!$A$3:$B$52,2,FALSE),0)","v":0},{"$f":"IF(Rang!Q46>0,VLOOKUP(Rang!Q46,Einstellungen!$A$3:$B$52,2,FALSE),0)","v":0},{"$f":"IF(Rang!R46>0,VLOOKUP(Rang!R46,Einstellungen!$A$3:$B$52,2,FALSE),0)","v":0},{"$f":"IF(Rang!S46>0,VLOOKUP(Rang!S46,Einstellungen!$A$3:$B$52,2,FALSE),0)","v":0},{"$f":"IF(Rang!T46>0,VLOOKUP(Rang!T46,Einstellungen!$A$3:$B$52,2,FALSE),0)","v":0},{"$f":"IF(Rang!U46>0,VLOOKUP(Rang!U46,Einstellungen!$A$3:$B$52,2,FALSE),0)","v":0},{"$f":"SUM(B46:U46)+IF($AY$4=2,AZ46,0)+IF($AY$4=3,BC46,0)","v":0},{"$f":"IF(SUM(B46:U46)>0,RANK(V46,$V$4:$V$53,0),0)","v":0},{"$f":"IF(SUM(B46:U46)>0,VLOOKUP(A46,TabRunden,22,FALSE),0)","v":0},{"$f":"AD46","v":0},{"$f":"IF(AD46>=$AT$2,LOOKUP($AL$2,$AE$3:$AX$3,AE46:AX46),0)+IF($AY$4=2,AZ46,0)+IF($AY$4=3,BC46,0)","v":0},{"$f":"IF(Z46>0,RANK(Z46,$Z$4:$Z$53,0),0)","v":0},{"$f":"IF(W46=0,51,W46)+IF(A46=\"\",50,0)","v":101},{"$f":"IF(AA46=0,51,AA46)+IF(A46=\"\",50,0)","v":101},0,0,{"$f":"LARGE($B46:$U46,AF$3)+AE46","v":0},0,0,0,0,0,0,0,0,0,0,0,0,0,0,0,0,0,0,null,0,0,0,{"$f":"IF(X46>0,VLOOKUP(A46,Rang!$A$4:$AU$53,47,FALSE))/1000","v":0}]
[{"$f":"IF(Runden!A47=\"\",\"\",Runden!A47)","v":""},{"$f":"IF(Rang!B47>0,VLOOKUP(Rang!B47,Einstellungen!$A$3:$B$52,2,FALSE),0)","v":0},{"$f":"IF(Rang!C47>0,VLOOKUP(Rang!C47,Einstellungen!$A$3:$B$52,2,FALSE),0)","v":0},{"$f":"IF(Rang!D47>0,VLOOKUP(Rang!D47,Einstellungen!$A$3:$B$52,2,FALSE),0)","v":0},{"$f":"IF(Rang!E47>0,VLOOKUP(Rang!E47,Einstellungen!$A$3:$B$52,2,FALSE),0)","v":0},{"$f":"IF(Rang!F47>0,VLOOKUP(Rang!F47,Einstellungen!$A$3:$B$52,2,FALSE),0)","v":0},{"$f":"IF(Rang!G47>0,VLOOKUP(Rang!G47,Einstellungen!$A$3:$B$52,2,FALSE),0)","v":0},{"$f":"IF(Rang!H47>0,VLOOKUP(Rang!H47,Einstellungen!$A$3:$B$52,2,FALSE),0)","v":0},{"$f":"IF(Rang!I47>0,VLOOKUP(Rang!I47,Einstellungen!$A$3:$B$52,2,FALSE),0)","v":0},{"$f":"IF(Rang!J47>0,VLOOKUP(Rang!J47,Einstellungen!$A$3:$B$52,2,FALSE),0)","v":0},{"$f":"IF(Rang!K47>0,VLOOKUP(Rang!K47,Einstellungen!$A$3:$B$52,2,FALSE),0)","v":0},{"$f":"IF(Rang!L47>0,VLOOKUP(Rang!L47,Einstellungen!$A$3:$B$52,2,FALSE),0)","v":0},{"$f":"IF(Rang!M47>0,VLOOKUP(Rang!M47,Einstellungen!$A$3:$B$52,2,FALSE),0)","v":0},{"$f":"IF(Rang!N47>0,VLOOKUP(Rang!N47,Einstellungen!$A$3:$B$52,2,FALSE),0)","v":0},{"$f":"IF(Rang!O47>0,VLOOKUP(Rang!O47,Einstellungen!$A$3:$B$52,2,FALSE),0)","v":0},{"$f":"IF(Rang!P47>0,VLOOKUP(Rang!P47,Einstellungen!$A$3:$B$52,2,FALSE),0)","v":0},{"$f":"IF(Rang!Q47>0,VLOOKUP(Rang!Q47,Einstellungen!$A$3:$B$52,2,FALSE),0)","v":0},{"$f":"IF(Rang!R47>0,VLOOKUP(Rang!R47,Einstellungen!$A$3:$B$52,2,FALSE),0)","v":0},{"$f":"IF(Rang!S47>0,VLOOKUP(Rang!S47,Einstellungen!$A$3:$B$52,2,FALSE),0)","v":0},{"$f":"IF(Rang!T47>0,VLOOKUP(Rang!T47,Einstellungen!$A$3:$B$52,2,FALSE),0)","v":0},{"$f":"IF(Rang!U47>0,VLOOKUP(Rang!U47,Einstellungen!$A$3:$B$52,2,FALSE),0)","v":0},{"$f":"SUM(B47:U47)+IF($AY$4=2,AZ47,0)+IF($AY$4=3,BC47,0)","v":0},{"$f":"IF(SUM(B47:U47)>0,RANK(V47,$V$4:$V$53,0),0)","v":0},{"$f":"IF(SUM(B47:U47)>0,VLOOKUP(A47,TabRunden,22,FALSE),0)","v":0},{"$f":"AD47","v":0},{"$f":"IF(AD47>=$AT$2,LOOKUP($AL$2,$AE$3:$AX$3,AE47:AX47),0)+IF($AY$4=2,AZ47,0)+IF($AY$4=3,BC47,0)","v":0},{"$f":"IF(Z47>0,RANK(Z47,$Z$4:$Z$53,0),0)","v":0},{"$f":"IF(W47=0,51,W47)+IF(A47=\"\",50,0)","v":101},{"$f":"IF(AA47=0,51,AA47)+IF(A47=\"\",50,0)","v":101},0,0,{"$f":"LARGE($B47:$U47,AF$3)+AE47","v":0},0,0,0,0,0,0,0,0,0,0,0,0,0,0,0,0,0,0,null,0,0,0,{"$f":"IF(X47>0,VLOOKUP(A47,Rang!$A$4:$AU$53,47,FALSE))/1000","v":0}]
[{"$f":"IF(Runden!A48=\"\",\"\",Runden!A48)","v":""},{"$f":"IF(Rang!B48>0,VLOOKUP(Rang!B48,Einstellungen!$A$3:$B$52,2,FALSE),0)","v":0},{"$f":"IF(Rang!C48>0,VLOOKUP(Rang!C48,Einstellungen!$A$3:$B$52,2,FALSE),0)","v":0},{"$f":"IF(Rang!D48>0,VLOOKUP(Rang!D48,Einstellungen!$A$3:$B$52,2,FALSE),0)","v":0},{"$f":"IF(Rang!E48>0,VLOOKUP(Rang!E48,Einstellungen!$A$3:$B$52,2,FALSE),0)","v":0},{"$f":"IF(Rang!F48>0,VLOOKUP(Rang!F48,Einstellungen!$A$3:$B$52,2,FALSE),0)","v":0},{"$f":"IF(Rang!G48>0,VLOOKUP(Rang!G48,Einstellungen!$A$3:$B$52,2,FALSE),0)","v":0},{"$f":"IF(Rang!H48>0,VLOOKUP(Rang!H48,Einstellungen!$A$3:$B$52,2,FALSE),0)","v":0},{"$f":"IF(Rang!I48>0,VLOOKUP(Rang!I48,Einstellungen!$A$3:$B$52,2,FALSE),0)","v":0},{"$f":"IF(Rang!J48>0,VLOOKUP(Rang!J48,Einstellungen!$A$3:$B$52,2,FALSE),0)","v":0},{"$f":"IF(Rang!K48>0,VLOOKUP(Rang!K48,Einstellungen!$A$3:$B$52,2,FALSE),0)","v":0},{"$f":"IF(Rang!L48>0,VLOOKUP(Rang!L48,Einstellungen!$A$3:$B$52,2,FALSE),0)","v":0},{"$f":"IF(Rang!M48>0,VLOOKUP(Rang!M48,Einstellungen!$A$3:$B$52,2,FALSE),0)","v":0},{"$f":"IF(Rang!N48>0,VLOOKUP(Rang!N48,Einstellungen!$A$3:$B$52,2,FALSE),0)","v":0},{"$f":"IF(Rang!O48>0,VLOOKUP(Rang!O48,Einstellungen!$A$3:$B$52,2,FALSE),0)","v":0},{"$f":"IF(Rang!P48>0,VLOOKUP(Rang!P48,Einstellungen!$A$3:$B$52,2,FALSE),0)","v":0},{"$f":"IF(Rang!Q48>0,VLOOKUP(Rang!Q48,Einstellungen!$A$3:$B$52,2,FALSE),0)","v":0},{"$f":"IF(Rang!R48>0,VLOOKUP(Rang!R48,Einstellungen!$A$3:$B$52,2,FALSE),0)","v":0},{"$f":"IF(Rang!S48>0,VLOOKUP(Rang!S48,Einstellungen!$A$3:$B$52,2,FALSE),0)","v":0},{"$f":"IF(Rang!T48>0,VLOOKUP(Rang!T48,Einstellungen!$A$3:$B$52,2,FALSE),0)","v":0},{"$f":"IF(Rang!U48>0,VLOOKUP(Rang!U48,Einstellungen!$A$3:$B$52,2,FALSE),0)","v":0},{"$f":"SUM(B48:U48)+IF($AY$4=2,AZ48,0)+IF($AY$4=3,BC48,0)","v":0},{"$f":"IF(SUM(B48:U48)>0,RANK(V48,$V$4:$V$53,0),0)","v":0},{"$f":"IF(SUM(B48:U48)>0,VLOOKUP(A48,TabRunden,22,FALSE),0)","v":0},{"$f":"AD48","v":0},{"$f":"IF(AD48>=$AT$2,LOOKUP($AL$2,$AE$3:$AX$3,AE48:AX48),0)+IF($AY$4=2,AZ48,0)+IF($AY$4=3,BC48,0)","v":0},{"$f":"IF(Z48>0,RANK(Z48,$Z$4:$Z$53,0),0)","v":0},{"$f":"IF(W48=0,51,W48)+IF(A48=\"\",50,0)","v":101},{"$f":"IF(AA48=0,51,AA48)+IF(A48=\"\",50,0)","v":101},0,0,{"$f":"LARGE($B48:$U48,AF$3)+AE48","v":0},0,0,0,0,0,0,0,0,0,0,0,0,0,0,0,0,0,0,null,0,0,0,{"$f":"IF(X48>0,VLOOKUP(A48,Rang!$A$4:$AU$53,47,FALSE))/1000","v":0}]
[{"$f":"IF(Runden!A49=\"\",\"\",Runden!A49)","v":""},{"$f":"IF(Rang!B49>0,VLOOKUP(Rang!B49,Einstellungen!$A$3:$B$52,2,FALSE),0)","v":0},{"$f":"IF(Rang!C49>0,VLOOKUP(Rang!C49,Einstellungen!$A$3:$B$52,2,FALSE),0)","v":0},{"$f":"IF(Rang!D49>0,VLOOKUP(Rang!D49,Einstellungen!$A$3:$B$52,2,FALSE),0)","v":0},{"$f":"IF(Rang!E49>0,VLOOKUP(Rang!E49,Einstellungen!$A$3:$B$52,2,FALSE),0)","v":0},{"$f":"IF(Rang!F49>0,VLOOKUP(Rang!F49,Einstellungen!$A$3:$B$52,2,FALSE),0)","v":0},{"$f":"IF(Rang!G49>0,VLOOKUP(Rang!G49,Einstellungen!$A$3:$B$52,2,FALSE),0)","v":0},{"$f":"IF(Rang!H49>0,VLOOKUP(Rang!H49,Einstellungen!$A$3:$B$52,2,FALSE),0)","v":0},{"$f":"IF(Rang!I49>0,VLOOKUP(Rang!I49,Einstellungen!$A$3:$B$52,2,FALSE),0)","v":0},{"$f":"IF(Rang!J49>0,VLOOKUP(Rang!J49,Einstellungen!$A$3:$B$52,2,FALSE),0)","v":0},{"$f":"IF(Rang!K49>0,VLOOKUP(Rang!K49,Einstellungen!$A$3:$B$52,2,FALSE),0)","v":0},{"$f":"IF(Rang!L49>0,VLOOKUP(Rang!L49,Einstellungen!$A$3:$B$52,2,FALSE),0)","v":0},{"$f":"IF(Rang!M49>0,VLOOKUP(Rang!M49,Einstellungen!$A$3:$B$52,2,FALSE),0)","v":0},{"$f":"IF(Rang!N49>0,VLOOKUP(Rang!N49,Einstellungen!$A$3:$B$52,2,FALSE),0)","v":0},{"$f":"IF(Rang!O49>0,VLOOKUP(Rang!O49,Einstellungen!$A$3:$B$52,2,FALSE),0)","v":0},{"$f":"IF(Rang!P49>0,VLOOKUP(Rang!P49,Einstellungen!$A$3:$B$52,2,FALSE),0)","v":0},{"$f":"IF(Rang!Q49>0,VLOOKUP(Rang!Q49,Einstellungen!$A$3:$B$52,2,FALSE),0)","v":0},{"$f":"IF(Rang!R49>0,VLOOKUP(Rang!R49,Einstellungen!$A$3:$B$52,2,FALSE),0)","v":0},{"$f":"IF(Rang!S49>0,VLOOKUP(Rang!S49,Einstellungen!$A$3:$B$52,2,FALSE),0)","v":0},{"$f":"IF(Rang!T49>0,VLOOKUP(Rang!T49,Einstellungen!$A$3:$B$52,2,FALSE),0)","v":0},{"$f":"IF(Rang!U49>0,VLOOKUP(Rang!U49,Einstellungen!$A$3:$B$52,2,FALSE),0)","v":0},{"$f":"SUM(B49:U49)+IF($AY$4=2,AZ49,0)+IF($AY$4=3,BC49,0)","v":0},{"$f":"IF(SUM(B49:U49)>0,RANK(V49,$V$4:$V$53,0),0)","v":0},{"$f":"IF(SUM(B49:U49)>0,VLOOKUP(A49,TabRunden,22,FALSE),0)","v":0},{"$f":"AD49","v":0},{"$f":"IF(AD49>=$AT$2,LOOKUP($AL$2,$AE$3:$AX$3,AE49:AX49),0)+IF($AY$4=2,AZ49,0)+IF($AY$4=3,BC49,0)","v":0},{"$f":"IF(Z49>0,RANK(Z49,$Z$4:$Z$53,0),0)","v":0},{"$f":"IF(W49=0,51,W49)+IF(A49=\"\",50,0)","v":101},{"$f":"IF(AA49=0,51,AA49)+IF(A49=\"\",50,0)","v":101},0,0,{"$f":"LARGE($B49:$U49,AF$3)+AE49","v":0},0,0,0,0,0,0,0,0,0,0,0,0,0,0,0,0,0,0,null,0,0,0,{"$f":"IF(X49>0,VLOOKUP(A49,Rang!$A$4:$AU$53,47,FALSE))/1000","v":0}]
[{"$f":"IF(Runden!A50=\"\",\"\",Runden!A50)","v":""},{"$f":"IF(Rang!B50>0,VLOOKUP(Rang!B50,Einstellungen!$A$3:$B$52,2,FALSE),0)","v":0},{"$f":"IF(Rang!C50>0,VLOOKUP(Rang!C50,Einstellungen!$A$3:$B$52,2,FALSE),0)","v":0},{"$f":"IF(Rang!D50>0,VLOOKUP(Rang!D50,Einstellungen!$A$3:$B$52,2,FALSE),0)","v":0},{"$f":"IF(Rang!E50>0,VLOOKUP(Rang!E50,Einstellungen!$A$3:$B$52,2,FALSE),0)","v":0},{"$f":"IF(Rang!F50>0,VLOOKUP(Rang!F50,Einstellungen!$A$3:$B$52,2,FALSE),0)","v":0},{"$f":"IF(Rang!G50>0,VLOOKUP(Rang!G50,Einstellungen!$A$3:$B$52,2,FALSE),0)","v":0},{"$f":"IF(Rang!H50>0,VLOOKUP(Rang!H50,Einstellungen!$A$3:$B$52,2,FALSE),0)","v":0},{"$f":"IF(Rang!I50>0,VLOOKUP(Rang!I50,Einstellungen!$A$3:$B$52,2,FALSE),0)","v":0},{"$f":"IF(Rang!J50>0,VLOOKUP(Rang!J50,Einstellungen!$A$3:$B$52,2,FALSE),0)","v":0},{"$f":"IF(Rang!K50>0,VLOOKUP(Rang!K50,Einstellungen!$A$3:$B$52,2,FALSE),0)","v":0},{"$f":"IF(Rang!L50>0,VLOOKUP(Rang!L50,Einstellungen!$A$3:$B$52,2,FALSE),0)","v":0},{"$f":"IF(Rang!M50>0,VLOOKUP(Rang!M50,Einstellungen!$A$3:$B$52,2,FALSE),0)","v":0},{"$f":"IF(Rang!N50>0,VLOOKUP(Rang!N50,Einstellungen!$A$3:$B$52,2,FALSE),0)","v":0},{"$f":"IF(Rang!O50>0,VLOOKUP(Rang!O50,Einstellungen!$A$3:$B$52,2,FALSE),0)","v":0},{"$f":"IF(Rang!P50>0,VLOOKUP(Rang!P50,Einstellungen!$A$3:$B$52,2,FALSE),0)","v":0},{"$f":"IF(Rang!Q50>0,VLOOKUP(Rang!Q50,Einstellungen!$A$3:$B$52,2,FALSE),0)","v":0},{"$f":"IF(Rang!R50>0,VLOOKUP(Rang!R50,Einstellungen!$A$3:$B$52,2,FALSE),0)","v":0},{"$f":"IF(Rang!S50>0,VLOOKUP(Rang!S50,Einstellungen!$A$3:$B$52,2,FALSE),0)","v":0},{"$f":"IF(Rang!T50>0,VLOOKUP(Rang!T50,Einstellungen!$A$3:$B$52,2,FALSE),0)","v":0},{"$f":"IF(Rang!U50>0,VLOOKUP(Rang!U50,Einstellungen!$A$3:$B$52,2,FALSE),0)","v":0},{"$f":"SUM(B50:U50)+IF($AY$4=2,AZ50,0)+IF($AY$4=3,BC50,0)","v":0},{"$f":"IF(SUM(B50:U50)>0,RANK(V50,$V$4:$V$53,0),0)","v":0},{"$f":"IF(SUM(B50:U50)>0,VLOOKUP(A50,TabRunden,22,FALSE),0)","v":0},{"$f":"AD50","v":0},{"$f":"IF(AD50>=$AT$2,LOOKUP($AL$2,$AE$3:$AX$3,AE50:AX50),0)+IF($AY$4=2,AZ50,0)+IF($AY$4=3,BC50,0)","v":0},{"$f":"IF(Z50>0,RANK(Z50,$Z$4:$Z$53,0),0)","v":0},{"$f":"IF(W50=0,51,W50)+IF(A50=\"\",50,0)","v":101},{"$f":"IF(AA50=0,51,AA50)+IF(A50=\"\",50,0)","v":101},0,0,{"$f":"LARGE($B50:$U50,AF$3)+AE50","v":0},0,0,0,0,0,0,0,0,0,0,0,0,0,0,0,0,0,0,null,0,0,0,{"$f":"IF(X50>0,VLOOKUP(A50,Rang!$A$4:$AU$53,47,FALSE))/1000","v":0}]
[{"$f":"IF(Runden!A51=\"\",\"\",Runden!A51)","v":""},{"$f":"IF(Rang!B51>0,VLOOKUP(Rang!B51,Einstellungen!$A$3:$B$52,2,FALSE),0)","v":0},{"$f":"IF(Rang!C51>0,VLOOKUP(Rang!C51,Einstellungen!$A$3:$B$52,2,FALSE),0)","v":0},{"$f":"IF(Rang!D51>0,VLOOKUP(Rang!D51,Einstellungen!$A$3:$B$52,2,FALSE),0)","v":0},{"$f":"IF(Rang!E51>0,VLOOKUP(Rang!E51,Einstellungen!$A$3:$B$52,2,FALSE),0)","v":0},{"$f":"IF(Rang!F51>0,VLOOKUP(Rang!F51,Einstellungen!$A$3:$B$52,2,FALSE),0)","v":0},{"$f":"IF(Rang!G51>0,VLOOKUP(Rang!G51,Einstellungen!$A$3:$B$52,2,FALSE),0)","v":0},{"$f":"IF(Rang!H51>0,VLOOKUP(Rang!H51,Einstellungen!$A$3:$B$52,2,FALSE),0)","v":0},{"$f":"IF(Rang!I51>0,VLOOKUP(Rang!I51,Einstellungen!$A$3:$B$52,2,FALSE),0)","v":0},{"$f":"IF(Rang!J51>0,VLOOKUP(Rang!J51,Einstellungen!$A$3:$B$52,2,FALSE),0)","v":0},{"$f":"IF(Rang!K51>0,VLOOKUP(Rang!K51,Einstellungen!$A$3:$B$52,2,FALSE),0)","v":0},{"$f":"IF(Rang!L51>0,VLOOKUP(Rang!L51,Einstellungen!$A$3:$B$52,2,FALSE),0)","v":0},{"$f":"IF(Rang!M51>0,VLOOKUP(Rang!M51,Einstellungen!$A$3:$B$52,2,FALSE),0)","v":0},{"$f":"IF(Rang!N51>0,VLOOKUP(Rang!N51,Einstellungen!$A$3:$B$52,2,FALSE),0)","v":0},{"$f":"IF(Rang!O51>0,VLOOKUP(Rang!O51,Einstellungen!$A$3:$B$52,2,FALSE),0)","v":0},{"$f":"IF(Rang!P51>0,VLOOKUP(Rang!P51,Einstellungen!$A$3:$B$52,2,FALSE),0)","v":0},{"$f":"IF(Rang!Q51>0,VLOOKUP(Rang!Q51,Einstellungen!$A$3:$B$52,2,FALSE),0)","v":0},{"$f":"IF(Rang!R51>0,VLOOKUP(Rang!R51,Einstellungen!$A$3:$B$52,2,FALSE),0)","v":0},{"$f":"IF(Rang!S51>0,VLOOKUP(Rang!S51,Einstellungen!$A$3:$B$52,2,FALSE),0)","v":0},{"$f":"IF(Rang!T51>0,VLOOKUP(Rang!T51,Einstellungen!$A$3:$B$52,2,FALSE),0)","v":0},{"$f":"IF(Rang!U51>0,VLOOKUP(Rang!U51,Einstellungen!$A$3:$B$52,2,FALSE),0)","v":0},{"$f":"SUM(B51:U51)+IF($AY$4=2,AZ51,0)+IF($AY$4=3,BC51,0)","v":0},{"$f":"IF(SUM(B51:U51)>0,RANK(V51,$V$4:$V$53,0),0)","v":0},{"$f":"IF(SUM(B51:U51)>0,VLOOKUP(A51,TabRunden,22,FALSE),0)","v":0},{"$f":"AD51","v":0},{"$f":"IF(AD51>=$AT$2,LOOKUP($AL$2,$AE$3:$AX$3,AE51:AX51),0)+IF($AY$4=2,AZ51,0)+IF($AY$4=3,BC51,0)","v":0},{"$f":"IF(Z51>0,RANK(Z51,$Z$4:$Z$53,0),0)","v":0},{"$f":"IF(W51=0,51,W51)+IF(A51=\"\",50,0)","v":101},{"$f":"IF(AA51=0,51,AA51)+IF(A51=\"\",50,0)","v":101},0,0,{"$f":"LARGE($B51:$U51,AF$3)+AE51","v":0},0,0,0,0,0,0,0,0,0,0,0,0,0,0,0,0,0,0,null,0,0,0,{"$f":"IF(X51>0,VLOOKUP(A51,Rang!$A$4:$AU$53,47,FALSE))/1000","v":0}]
[{"$f":"IF(Runden!A52=\"\",\"\",Runden!A52)","v":""},{"$f":"IF(Rang!B52>0,VLOOKUP(Rang!B52,Einstellungen!$A$3:$B$52,2,FALSE),0)","v":0},{"$f":"IF(Rang!C52>0,VLOOKUP(Rang!C52,Einstellungen!$A$3:$B$52,2,FALSE),0)","v":0},{"$f":"IF(Rang!D52>0,VLOOKUP(Rang!D52,Einstellungen!$A$3:$B$52,2,FALSE),0)","v":0},{"$f":"IF(Rang!E52>0,VLOOKUP(Rang!E52,Einstellungen!$A$3:$B$52,2,FALSE),0)","v":0},{"$f":"IF(Rang!F52>0,VLOOKUP(Rang!F52,Einstellungen!$A$3:$B$52,2,FALSE),0)","v":0},{"$f":"IF(Rang!G52>0,VLOOKUP(Rang!G52,Einstellungen!$A$3:$B$52,2,FALSE),0)","v":0},{"$f":"IF(Rang!H52>0,VLOOKUP(Rang!H52,Einstellungen!$A$3:$B$52,2,FALSE),0)","v":0},{"$f":"IF(Rang!I52>0,VLOOKUP(Rang!I52,Einstellungen!$A$3:$B$52,2,FALSE),0)","v":0},{"$f":"IF(Rang!J52>0,VLOOKUP(Rang!J52,Einstellungen!$A$3:$B$52,2,FALSE),0)","v":0},{"$f":"IF(Rang!K52>0,VLOOKUP(Rang!K52,Einstellungen!$A$3:$B$52,2,FALSE),0)","v":0},{"$f":"IF(Rang!L52>0,VLOOKUP(Rang!L52,Einstellungen!$A$3:$B$52,2,FALSE),0)","v":0},{"$f":"IF(Rang!M52>0,VLOOKUP(Rang!M52,Einstellungen!$A$3:$B$52,2,FALSE),0)","v":0},{"$f":"IF(Rang!N52>0,VLOOKUP(Rang!N52,Einstellungen!$A$3:$B$52,2,FALSE),0)","v":0},{"$f":"IF(Rang!O52>0,VLOOKUP(Rang!O52,Einstellungen!$A$3:$B$52,2,FALSE),0)","v":0},{"$f":"IF(Rang!P52>0,VLOOKUP(Rang!P52,Einstellungen!$A$3:$B$52,2,FALSE),0)","v":0},{"$f":"IF(Rang!Q52>0,VLOOKUP(Rang!Q52,Einstellungen!$A$3:$B$52,2,FALSE),0)","v":0},{"$f":"IF(Rang!R52>0,VLOOKUP(Rang!R52,Einstellungen!$A$3:$B$52,2,FALSE),0)","v":0},{"$f":"IF(Rang!S52>0,VLOOKUP(Rang!S52,Einstellungen!$A$3:$B$52,2,FALSE),0)","v":0},{"$f":"IF(Rang!T52>0,VLOOKUP(Rang!T52,Einstellungen!$A$3:$B$52,2,FALSE),0)","v":0},{"$f":"IF(Rang!U52>0,VLOOKUP(Rang!U52,Einstellungen!$A$3:$B$52,2,FALSE),0)","v":0},{"$f":"SUM(B52:U52)+IF($AY$4=2,AZ52,0)+IF($AY$4=3,BC52,0)","v":0},{"$f":"IF(SUM(B52:U52)>0,RANK(V52,$V$4:$V$53,0),0)","v":0},{"$f":"IF(SUM(B52:U52)>0,VLOOKUP(A52,TabRunden,22,FALSE),0)","v":0},{"$f":"AD52","v":0},{"$f":"IF(AD52>=$AT$2,LOOKUP($AL$2,$AE$3:$AX$3,AE52:AX52),0)+IF($AY$4=2,AZ52,0)+IF($AY$4=3,BC52,0)","v":0},{"$f":"IF(Z52>0,RANK(Z52,$Z$4:$Z$53,0),0)","v":0},{"$f":"IF(W52=0,51,W52)+IF(A52=\"\",50,0)","v":101},{"$f":"IF(AA52=0,51,AA52)+IF(A52=\"\",50,0)","v":101},0,0,{"$f":"LARGE($B52:$U52,AF$3)+AE52","v":0},0,0,0,0,0,0,0,0,0,0,0,0,0,0,0,0,0,0,null,0,0,0,{"$f":"IF(X52>0,VLOOKUP(A52,Rang!$A$4:$AU$53,47,FALSE))/1000","v":0}]
[{"$f":"IF(Runden!A53=\"\",\"\",Runden!A53)","v":""},{"$f":"IF(Rang!B53>0,VLOOKUP(Rang!B53,Einstellungen!$A$3:$B$52,2,FALSE),0)","v":0},{"$f":"IF(Rang!C53>0,VLOOKUP(Rang!C53,Einstellungen!$A$3:$B$52,2,FALSE),0)","v":0},{"$f":"IF(Rang!D53>0,VLOOKUP(Rang!D53,Einstellungen!$A$3:$B$52,2,FALSE),0)","v":0},{"$f":"IF(Rang!E53>0,VLOOKUP(Rang!E53,Einstellungen!$A$3:$B$52,2,FALSE),0)","v":0},{"$f":"IF(Rang!F53>0,VLOOKUP(Rang!F53,Einstellungen!$A$3:$B$52,2,FALSE),0)","v":0},{"$f":"IF(Rang!G53>0,VLOOKUP(Rang!G53,Einstellungen!$A$3:$B$52,2,FALSE),0)","v":0},{"$f":"IF(Rang!H53>0,VLOOKUP(Rang!H53,Einstellungen!$A$3:$B$52,2,FALSE),0)","v":0},{"$f":"IF(Rang!I53>0,VLOOKUP(Rang!I53,Einstellungen!$A$3:$B$52,2,FALSE),0)","v":0},{"$f":"IF(Rang!J53>0,VLOOKUP(Rang!J53,Einstellungen!$A$3:$B$52,2,FALSE),0)","v":0},{"$f":"IF(Rang!K53>0,VLOOKUP(Rang!K53,Einstellungen!$A$3:$B$52,2,FALSE),0)","v":0},{"$f":"IF(Rang!L53>0,VLOOKUP(Rang!L53,Einstellungen!$A$3:$B$52,2,FALSE),0)","v":0},{"$f":"IF(Rang!M53>0,VLOOKUP(Rang!M53,Einstellungen!$A$3:$B$52,2,FALSE),0)","v":0},{"$f":"IF(Rang!N53>0,VLOOKUP(Rang!N53,Einstellungen!$A$3:$B$52,2,FALSE),0)","v":0},{"$f":"IF(Rang!O53>0,VLOOKUP(Rang!O53,Einstellungen!$A$3:$B$52,2,FALSE),0)","v":0},{"$f":"IF(Rang!P53>0,VLOOKUP(Rang!P53,Einstellungen!$A$3:$B$52,2,FALSE),0)","v":0},{"$f":"IF(Rang!Q53>0,VLOOKUP(Rang!Q53,Einstellungen!$A$3:$B$52,2,FALSE),0)","v":0},{"$f":"IF(Rang!R53>0,VLOOKUP(Rang!R53,Einstellungen!$A$3:$B$52,2,FALSE),0)","v":0},{"$f":"IF(Rang!S53>0,VLOOKUP(Rang!S53,Einstellungen!$A$3:$B$52,2,FALSE),0)","v":0},{"$f":"IF(Rang!T53>0,VLOOKUP(Rang!T53,Einstellungen!$A$3:$B$52,2,FALSE),0)","v":0},{"$f":"IF(Rang!U53>0,VLOOKUP(Rang!U53,Einstellungen!$A$3:$B$52,2,FALSE),0)","v":0},{"$f":"SUM(B53:U53)+IF($AY$4=2,AZ53,0)+IF($AY$4=3,BC53,0)","v":0},{"$f":"IF(SUM(B53:U53)>0,RANK(V53,$V$4:$V$53,0),0)","v":0},{"$f":"IF(SUM(B53:U53)>0,VLOOKUP(A53,TabRunden,22,FALSE),0)","v":0},{"$f":"AD53","v":0},{"$f":"IF(AD53>=$AT$2,LOOKUP($AL$2,$AE$3:$AX$3,AE53:AX53),0)+IF($AY$4=2,AZ53,0)+IF($AY$4=3,BC53,0)","v":0},{"$f":"IF(Z53>0,RANK(Z53,$Z$4:$Z$53,0),0)","v":0},{"$f":"IF(W53=0,51,W53)+IF(A53=\"\",50,0)","v":101},{"$f":"IF(AA53=0,51,AA53)+IF(A53=\"\",50,0)","v":101},0,0,{"$f":"LARGE($B53:$U53,AF$3)+AE53","v":0},0,0,0,0,0,0,0,0,0,0,0,0,0,0,0,0,0,0,null,0,0,0,{"$f":"IF(X53>0,VLOOKUP(A53,Rang!$A$4:$AU$53,47,FALSE))/1000","v":0}]
["Teilnehmer:",{"$f":"COUNTIF(B4:B53,\">0\")","v":10},{"$f":"COUNTIF(C4:C53,\">0\")","v":0},0,0,0,0,0,0,0,0,0,0,0,0,0,0,0,0,0,0]

{"sheet":"Ergebnis Lauf","index":4,"n_rows":54,"n_cols":11,"rows_kept":54,"cut":false,"hidden":false,"merged":[]}
[{"$f":"Einstellungen!D9","v":"DTM2019"},"Ergebnis Lauf:",null,{"$f":"COUNTIF(Runden!B54:U54,\">0\")","v":1},null,null,"Gewertete",null,"Stand"]
[null,null,"am",{"$f":"IF(D1=0,0,CHOOSE(D1,Runden!B3,Runden!C3,Runden!D3,Runden!E3,Runden!F3,Runden!G3,Runden!H3,Runden!I3,Runden!J3,Runden!K3,Runden!L3,Runden!M3,Runden!N3,Runden!O3,Runden!P3,Runden!Q3,Runden!R3,Runden!S3,Runden!T3,Runden!U3))","v":"2018-12-04"},null,null,"Läufe",{"$f":"\"nach dem \"&D1&\". Lauf\"","v":"nach dem 1. Lauf"}]
["Name","Runden","Rang","Punkte",null,"Name","Anzahl","Punkte","Platz","Runden"]
[{"$f":"IF(Runden!A4=\"\",\"\",Runden!A4)","v":"Ronald"},{"$f":"IF(A4=\"\",0,VLOOKUP(A4,Runden!$A$4:$U$53,IF($D$1=0,2,$D$1+1),FALSE))","v":134.65},{"$f":"IF(A4=\"\",0,VLOOKUP(A4,Rang!$A$4:$U$53,IF($D$1=0,2,$D$1+1),FALSE))","v":7},{"$f":"IF(A4=\"\",0,VLOOKUP(A4,Punkte!$A$4:$U$53,IF($D$1=0,2,$D$1+1),FALSE))","v":12},{"$f":"IF(C4=0,51,C4)+VLOOKUP(A4,Punkte!$A$4:$AC$53,27,FALSE)*0.001","v":7.0069999999999997},{"$f":"IF(Runden!A4=\"\",\"\",Runden!A4)","v":"Ronald"},{"$f":"IF(F4=\"\",0,VLOOKUP(F4,Punkte!$A$4:$AC$53,25,FALSE))","v":1},{"$f":"IF(F4=\"\",0,VLOOKUP(F4,Punkte!$A$4:$AC$53,22,FALSE))","v":12},{"$f":"IF(F4=\"\",0,VLOOKUP(F4,Punkte!$A$4:$AC$53,23,FALSE))","v":7},{"$f":"IF(F4=\"\",0,VLOOKUP(F4,Punkte!$A$4:$AC$53,24,FALSE))","v":134.65},{"$f":"IF(I4=0,51,I4)+IF(F4=\"\",50,0)","v":7}]
[{"$f":"IF(Runden!A5=\"\",\"\",Runden!A5)","v":"Günter"},{"$f":"IF(A5=\"\",0,VLOOKUP(A5,Runden!$A$4:$U$53,IF($D$1=0,2,$D$1+1),FALSE))","v":136.03},{"$f":"IF(A5=\"\",0,VLOOKUP(A5,Rang!$A$4:$U$53,IF($D$1=0,2,$D$1+1),FALSE))","v":5},{"$f":"IF(A5=\"\",0,VLOOKUP(A5,Punkte!$A$4:$U$53,IF($D$1=0,2,$D$1+1),FALSE))","v":14},{"$f":"IF(C5=0,51,C5)+VLOOKUP(A5,Punkte!$A$4:$AC$53,27,FALSE)*0.001","v":5.0049999999999999},{"$f":"IF(Runden!A5=\"\",\"\",Runden!A5)","v":"Günter"},{"$f":"IF(F5=\"\",0,VLOOKUP(F5,Punkte!$A$4:$AC$53,25,FALSE))","v":1},{"$f":"IF(F5=\"\",0,VLOOKUP(F5,Punkte!$A$4:$AC$53,22,FALSE))","v":14},{"$f":"IF(F5=\"\",0,VLOOKUP(F5,Punkte!$A$4:$AC$53,23,FALSE))","v":5},{"$f":"IF(F5=\"\",0,VLOOKUP(F5,Punkte!$A$4:$AC$53,24,FALSE))","v":136.03},5]
[{"$f":"IF(Runden!A6=\"\",\"\",Runden!A6)","v":"Marcus"},{"$f":"IF(A6=\"\",0,VLOOKUP(A6,Runden!$A$4:$U$53,IF($D$1=0,2,$D$1+1),FALSE))","v":135.38999999999999},{"$f":"IF(A6=\"\",0,VLOOKUP(A6,Rang!$A$4:$U$53,IF($D$1=0,2,$D$1+1),FALSE))","v":6},{"$f":"IF(A6=\"\",0,VLOOKUP(A6,Punkte!$A$4:$U$53,IF($D$1=0,2,$D$1+1),FALSE))","v":13},{"$f":"IF(C6=0,51,C6)+VLOOKUP(A6,Punkte!$A$4:$AC$53,27,FALSE)*0.001","v":6.0060000000000002},{"$f":"IF(Runden!A6=\"\",\"\",Runden!A6)","v":"Marcus"},{"$f":"IF(F6=\"\",0,VLOOKUP(F6,Punkte!$A$4:$AC$53,25,FALSE))","v":1},{"$f":"IF(F6=\"\",0,VLOOKUP(F6,Punkte!$A$4:$AC$53,22,FALSE))","v":13},{"$f":"IF(F6=\"\",0,VLOOKUP(F6,Punkte!$A$4:$AC$53,23,FALSE))","v":6},{"$f":"IF(F6=\"\",0,VLOOKUP(F6,Punkte!$A$4:$AC$53,24,FALSE))","v":135.38999999999999},6]
[{"$f":"IF(Runden!A7=\"\",\"\",Runden!A7)","v":"Dietmar"},{"$f":"IF(A7=\"\",0,VLOOKUP(A7,Runden!$A$4:$U$53,IF($D$1=0,2,$D$1+1),FALSE))","v":0},{"$f":"IF(A7=\"\",0,VLOOKUP(A7,Rang!$A$4:$U$53,IF($D$1=0,2,$D$1+1),FALSE))","v":0},{"$f":"IF(A7=\"\",0,VLOOKUP(A7,Punkte!$A$4:$U$53,IF($D$1=0,2,$D$1+1),FALSE))","v":0},{"$f":"IF(C7=0,51,C7)+VLOOKUP(A7,Punkte!$A$4:$AC$53,27,FALSE)*0.001","v":51},{"$f":"IF(Runden!A7=\"\",\"\",Runden!A7)","v":"Dietmar"},{"$f":"IF(F7=\"\",0,VLOOKUP(F7,Punkte!$A$4:$AC$53,25,FALSE))","v":0},{"$f":"IF(F7=\"\",0,VLOOKUP(F7,Punkte!$A$4:$AC$53,22,FALSE))","v":0},{"$f":"IF(F7=\"\",0,VLOOKUP(F7,Punkte!$A$4:$AC$53,23,FALSE))","v":0},{"$f":"IF(F7=\"\",0,VLOOKUP(F7,Punkte!$A$4:$AC$53,24,FALSE))","v":0},51]
[{"$f":"IF(Runden!A8=\"\",\"\",Runden!A8)","v":"Hans"},{"$f":"IF(A8=\"\",0,VLOOKUP(A8,Runden!$A$4:$U$53,IF($D$1=0,2,$D$1+1),FALSE))","v":137.30000000000001},{"$f":"IF(A8=\"\",0,VLOOKUP(A8,Rang!$A$4:$U$53,IF($D$1=0,2,$D$1+1),FALSE))","v":4},{"$f":"IF(A8=\"\",0,VLOOKUP(A8,Punkte!$A$4:$U$53,IF($D$1=0,2,$D$1+1),FALSE))","v":15},{"$f":"IF(C8=0,51,C8)+VLOOKUP(A8,Punkte!$A$4:$AC$53,27,FALSE)*0.001","v":4.0039999999999996},{"$f":"IF(Runden!A8=\"\",\"\",Runden!A8)","v":"Hans"},{"$f":"IF(F8=\"\",0,VLOOKUP(F8,Punkte!$A$4:$AC$53,25,FALSE))","v":1},{"$f":"IF(F8=\"\",0,VLOOKUP(F8,Punkte!$A$4:$AC$53,22,FALSE))","v":15},{"$f":"IF(F8=\"\",0,VLOOKUP(F8,Punkte!$A$4:$AC$53,23,FALSE))","v":4},{"$f":"IF(F8=\"\",0,VLOOKUP(F8,Punkte!$A$4:$AC$53,24,FALSE))","v":137.30000000000001},4]
[{"$f":"IF(Runden!A9=\"\",\"\",Runden!A9)","v":"Chris"},{"$f":"IF(A9=\"\",0,VLOOKUP(A9,Runden!$A$4:$U$53,IF($D$1=0,2,$D$1+1),FALSE))","v":139.4},{"$f":"IF(A9=\"\",0,VLOOKUP(A9,Rang!$A$4:$U$53,IF($D$1=0,2,$D$1+1),FALSE))","v":2},{"$f":"IF(A9=\"\",0,VLOOKUP(A9,Punkte!$A$4:$U$53,IF($D$1=0,2,$D$1+1),FALSE))","v":18},{"$f":"IF(C9=0,51,C9)+VLOOKUP(A9,Punkte!$A$4:$AC$53,27,FALSE)*0.001","v":2.0019999999999998},{"$f":"IF(Runden!A9=\"\",\"\",Runden!A9)","v":"Chris"},{"$f":"IF(F9=\"\",0,VLOOKUP(F9,Punkte!$A$4:$AC$53,25,FALSE))","v":1},{"$f":"IF(F9=\"\",0,VLOOKUP(F9,Punkte!$A$4:$AC$53,22,FALSE))","v":18},{"$f":"IF(F9=\"\",0,VLOOKUP(F9,Punkte!$A$4:$AC$53,23,FALSE))","v":2},{"$f":"IF(F9=\"\",0,VLOOKUP(F9,Punkte!$A$4:$AC$53,24,FALSE))","v":139.4},2]
[{"$f":"IF(Runden!A10=\"\",\"\",Runden!A10)","v":"Ewald"},{"$f":"IF(A10=\"\",0,VLOOKUP(A10,Runden!$A$4:$U$53,IF($D$1=0,2,$D$1+1),FALSE))","v":143.05000000000001},{"$f":"IF(A10=\"\",0,VLOOKUP(A10,Rang!$A$4:$U$53,IF($D$1=0,2,$D$1+1),FALSE))","v":1},{"$f":"IF(A10=\"\",0,VLOOKUP(A10,Punkte!$A$4:$U$53,IF($D$1=0,2,$D$1+1),FALSE))","v":20},{"$f":"IF(C10=0,51,C10)+VLOOKUP(A10,Punkte!$A$4:$AC$53,27,FALSE)*0.001","v":1.0009999999999999},{"$f":"IF(Runden!A10=\"\",\"\",Runden!A10)","v":"Ewald"},{"$f":"IF(F10=\"\",0,VLOOKUP(F10,Punkte!$A$4:$AC$53,25,FALSE))","v":1},{"$f":"IF(F10=\"\",0,VLOOKUP(F10,Punkte!$A$4:$AC$53,22,FALSE))","v":20},{"$f":"IF(F10=\"\",0,VLOOKUP(F10,Punkte!$A$4:$AC$53,23,FALSE))","v":1},{"$f":"IF(F10=\"\",0,VLOOKUP(F10,Punkte!$A$4:$AC$53,24,FALSE))","v":143.05000000000001},1]
[{"$f":"IF(Runden!A11=\"\",\"\",Runden!A11)","v":"Sven"},{"$f":"IF(A11=\"\",0,VLOOKUP(A11,Runden!$A$4:$U$53,IF($D$1=0,2,$D$1+1),FALSE))","v":0},{"$f":"IF(A11=\"\",0,VLOOKUP(A11,Rang!$A$4:$U$53,IF($D$1=0,2,$D$1+1),FALSE))","v":0},{"$f":"IF(A11=\"\",0,VLOOKUP(A11,Punkte!$A$4:$U$53,IF($D$1=0,2,$D$1+1),FALSE))","v":0},{"$f":"IF(C11=0,51,C11)+VLOOKUP(A11,Punkte!$A$4:$AC$53,27,FALSE)*0.001","v":51},{"$f":"IF(Runden!A11=\"\",\"\",Runden!A11)","v":"Sven"},{"$f":"IF(F11=\"\",0,VLOOKUP(F11,Punkte!$A$4:$AC$53,25,FALSE))","v":0},{"$f":"IF(F11=\"\",0,VLOOKUP(F11,Punkte!$A$4:$AC$53,22,FALSE))","v":0},{"$f":"IF(F11=\"\",0,VLOOKUP(F11,Punkte!$A$4:$AC$53,23,FALSE))","v":0},{"$f":"IF(F11=\"\",0,VLOOKUP(F11,Punkte!$A$4:$AC$53,24,FALSE))","v":0},51]
[{"$f":"IF(Runden!A12=\"\",\"\",Runden!A12)","v":"Thomas G."},{"$f":"IF(A12=\"\",0,VLOOKUP(A12,Runden!$A$4:$U$53,IF($D$1=0,2,$D$1+1),FALSE))","v":117.71},{"$f":"IF(A12=\"\",0,VLOOKUP(A12,Rang!$A$4:$U$53,IF($D$1=0,2,$D$1+1),FALSE))","v":10},{"$f":"IF(A12=\"\",0,VLOOKUP(A12,Punkte!$A$4:$U$53,IF($D$1=0,2,$D$1+1),FALSE))","v":9},{"$f":"IF(C12=0,51,C12)+VLOOKUP(A12,Punkte!$A$4:$AC$53,27,FALSE)*0.001","v":10.01},{"$f":"IF(Runden!A12=\"\",\"\",Runden!A12)","v":"Thomas G."},{"$f":"IF(F12=\"\",0,VLOOKUP(F12,Punkte!$A$4:$AC$53,25,FALSE))","v":1},{"$f":"IF(F12=\"\",0,VLOOKUP(F12,Punkte!$A$4:$AC$53,22,FALSE))","v":9},{"$f":"IF(F12=\"\",0,VLOOKUP(F12,Punkte!$A$4:$AC$53,23,FALSE))","v":10},{"$f":"IF(F12=\"\",0,VLOOKUP(F12,Punkte!$A$4:$AC$53,24,FALSE))","v":117.71},10]
[{"$f":"IF(Runden!A13=\"\",\"\",Runden!A13)","v":"Thomas S."},{"$f":"IF(A13=\"\",0,VLOOKUP(A13,Runden!$A$4:$U$53,IF($D$1=0,2,$D$1+1),FALSE))","v":120.57},{"$f":"IF(A13=\"\",0,VLOOKUP(A13,Rang!$A$4:$U$53,IF($D$1=0,2,$D$1+1),FALSE))","v":9},{"$f":"IF(A13=\"\",0,VLOOKUP(A13,Punkte!$A$4:$U$53,IF($D$1=0,2,$D$1+1),FALSE))","v":10},{"$f":"IF(C13=0,51,C13)+VLOOKUP(A13,Punkte!$A$4:$AC$53,27,FALSE)*0.001","v":9.0090000000000003},{"$f":"IF(Runden!A13=\"\",\"\",Runden!A13)","v":"Thomas S."},{"$f":"IF(F13=\"\",0,VLOOKUP(F13,Punkte!$A$4:$AC$53,25,FALSE))","v":1},{"$f":"IF(F13=\"\",0,VLOOKUP(F13,Punkte!$A$4:$AC$53,22,FALSE))","v":10},{"$f":"IF(F13=\"\",0,VLOOKUP(F13,Punkte!$A$4:$AC$53,23,FALSE))","v":9},{"$f":"IF(F13=\"\",0,VLOOKUP(F13,Punkte!$A$4:$AC$53,24,FALSE))","v":120.57},9]
[{"$f":"IF(Runden!A14=\"\",\"\",Runden!A14)","v":"Thomas V."},{"$f":"IF(A14=\"\",0,VLOOKUP(A14,Runden!$A$4:$U$53,IF($D$1=0,2,$D$1+1),FALSE))","v":138.22},{"$f":"IF(A14=\"\",0,VLOOKUP(A14,Rang!$A$4:$U$53,IF($D$1=0,2,$D$1+1),FALSE))","v":3},{"$f":"IF(A14=\"\",0,VLOOKUP(A14,Punkte!$A$4:$U$53,IF($D$1=0,2,$D$1+1),FALSE))","v":16},{"$f":"IF(C14=0,51,C14)+VLOOKUP(A14,Punkte!$A$4:$AC$53,27,FALSE)*0.001","v":3.0030000000000001},{"$f":"IF(Runden!A14=\"\",\"\",Runden!A14)","v":"Thomas V."},{"$f":"IF(F14=\"\",0,VLOOKUP(F14,Punkte!$A$4:$AC$53,25,FALSE))","v":1},{"$f":"IF(F14=\"\",0,VLOOKUP(F14,Punkte!$A$4:$AC$53,22,FALSE))","v":16},{"$f":"IF(F14=\"\",0,VLOOKUP(F14,Punkte!$A$4:$AC$53,23,FALSE))","v":3},{"$f":"IF(F14=\"\",0,VLOOKUP(F14,Punkte!$A$4:$AC$53,24,FALSE))","v":138.22},3]
[{"$f":"IF(Runden!A15=\"\",\"\",Runden!A15)","v":"Christoph"},{"$f":"IF(A15=\"\",0,VLOOKUP(A15,Runden!$A$4:$U$53,IF($D$1=0,2,$D$1+1),FALSE))","v":124.57},{"$f":"IF(A15=\"\",0,VLOOKUP(A15,Rang!$A$4:$U$53,IF($D$1=0,2,$D$1+1),FALSE))","v":8},{"$f":"IF(A15=\"\",0,VLOOKUP(A15,Punkte!$A$4:$U$53,IF($D$1=0,2,$D$1+1),FALSE))","v":11},{"$f":"IF(C15=0,51,C15)+VLOOKUP(A15,Punkte!$A$4:$AC$53,27,FALSE)*0.001","v":8.0079999999999991},{"$f":"IF(Runden!A15=\"\",\"\",Runden!A15)","v":"Christoph"},{"$f":"IF(F15=\"\",0,VLOOKUP(F15,Punkte!$A$4:$AC$53,25,FALSE))","v":1},{"$f":"IF(F15=\"\",0,VLOOKUP(F15,Punkte!$A$4:$AC$53,22,FALSE))","v":11},{"$f":"IF(F15=\"\",0,VLOOKUP(F15,Punkte!$A$4:$AC$53,23,FALSE))","v":8},{"$f":"IF(F15=\"\",0,VLOOKUP(F15,Punkte!$A$4:$AC$53,24,FALSE))","v":124.57},8]
[{"$f":"IF(Runden!A16=\"\",\"\",Runden!A16)","v":"Olli"},{"$f":"IF(A16=\"\",0,VLOOKUP(A16,Runden!$A$4:$U$53,IF($D$1=0,2,$D$1+1),FALSE))","v":0},{"$f":"IF(A16=\"\",0,VLOOKUP(A16,Rang!$A$4:$U$53,IF($D$1=0,2,$D$1+1),FALSE))","v":0},{"$f":"IF(A16=\"\",0,VLOOKUP(A16,Punkte!$A$4:$U$53,IF($D$1=0,2,$D$1+1),FALSE))","v":0},{"$f":"IF(C16=0,51,C16)+VLOOKUP(A16,Punkte!$A$4:$AC$53,27,FALSE)*0.001","v":51},{"$f":"IF(Runden!A16=\"\",\"\",Runden!A16)","v":"Olli"},{"$f":"IF(F16=\"\",0,VLOOKUP(F16,Punkte!$A$4:$AC$53,25,FALSE))","v":0},{"$f":"IF(F16=\"\",0,VLOOKUP(F16,Punkte!$A$4:$AC$53,22,FALSE))","v":0},{"$f":"IF(F16=\"\",0,VLOOKUP(F16,Punkte!$A$4:$AC$53,23,FALSE))","v":0},{"$f":"IF(F16=\"\",0,VLOOKUP(F16,Punkte!$A$4:$AC$53,24,FALSE))","v":0},51]
[{"$f":"IF(Runden!A17=\"\",\"\",Runden!A17)","v":"Horst"},{"$f":"IF(A17=\"\",0,VLOOKUP(A17,Runden!$A$4:$U$53,IF($D$1=0,2,$D$1+1),FALSE))","v":0},{"$f":"IF(A17=\"\",0,VLOOKUP(A17,Rang!$A$4:$U$53,IF($D$1=0,2,$D$1+1),FALSE))","v":0},{"$f":"IF(A17=\"\",0,VLOOKUP(A17,Punkte!$A$4:$U$53,IF($D$1=0,2,$D$1+1),FALSE))","v":0},{"$f":"IF(C17=0,51,C17)+VLOOKUP(A17,Punkte!$A$4:$AC$53,27,FALSE)*0.001","v":51},{"$f":"IF(Runden!A17=\"\",\"\",Runden!A17)","v":"Horst"},{"$f":"IF(F17=\"\",0,VLOOKUP(F17,Punkte!$A$4:$AC$53,25,FALSE))","v":0},{"$f":"IF(F17=\"\",0,VLOOKUP(F17,Punkte!$A$4:$AC$53,22,FALSE))","v":0},{"$f":"IF(F17=\"\",0,VLOOKUP(F17,Punkte!$A$4:$AC$53,23,FALSE))","v":0},{"$f":"IF(F17=\"\",0,VLOOKUP(F17,Punkte!$A$4:$AC$53,24,FALSE))","v":0},51]
[{"$f":"IF(Runden!A18=\"\",\"\",Runden!A18)","v":""},{"$f":"IF(A18=\"\",0,VLOOKUP(A18,Runden!$A$4:$U$53,IF($D$1=0,2,$D$1+1),FALSE))","v":0},{"$f":"IF(A18=\"\",0,VLOOKUP(A18,Rang!$A$4:$U$53,IF($D$1=0,2,$D$1+1),FALSE))","v":0},{"$f":"IF(A18=\"\",0,VLOOKUP(A18,Punkte!$A$4:$U$53,IF($D$1=0,2,$D$1+1),FALSE))","v":0},{"$f":"IF(C18=0,51,C18)+VLOOKUP(A18,Punkte!$A$4:$AC$53,27,FALSE)*0.001","v":51},{"$f":"IF(Runden!A18=\"\",\"\",Runden!A18)","v":""},{"$f":"IF(F18=\"\",0,VLOOKUP(F18,Punkte!$A$4:$AC$53,25,FALSE))","v":0},{"$f":"IF(F18=\"\",0,VLOOKUP(F18,Punkte!$A$4:$AC$53,22,FALSE))","v":0},{"$f":"IF(F18=\"\",0,VLOOKUP(F18,Punkte!$A$4:$AC$53,23,FALSE))","v":0},{"$f":"IF(F18=\"\",0,VLOOKUP(F18,Punkte!$A$4:$AC$53,24,FALSE))","v":0},101]
[{"$f":"IF(Runden!A19=\"\",\"\",Runden!A19)","v":""},{"$f":"IF(A19=\"\",0,VLOOKUP(A19,Runden!$A$4:$U$53,IF($D$1=0,2,$D$1+1),FALSE))","v":0},{"$f":"IF(A19=\"\",0,VLOOKUP(A19,Rang!$A$4:$U$53,IF($D$1=0,2,$D$1+1),FALSE))","v":0},{"$f":"IF(A19=\"\",0,VLOOKUP(A19,Punkte!$A$4:$U$53,IF($D$1=0,2,$D$1+1),FALSE))","v":0},{"$f":"IF(C19=0,51,C19)+VLOOKUP(A19,Punkte!$A$4:$AC$53,27,FALSE)*0.001","v":51},{"$f":"IF(Runden!A19=\"\",\"\",Runden!A19)","v":""},{"$f":"IF(F19=\"\",0,VLOOKUP(F19,Punkte!$A$4:$AC$53,25,FALSE))","v":0},{"$f":"IF(F19=\"\",0,VLOOKUP(F19,Punkte!$A$4:$AC$53,22,FALSE))","v":0},{"$f":"IF(F19=\"\",0,VLOOKUP(F19,Punkte!$A$4:$AC$53,23,FALSE))","v":0},{"$f":"IF(F19=\"\",0,VLOOKUP(F19,Punkte!$A$4:$AC$53,24,FALSE))","v":0},101]
[{"$f":"IF(Runden!A20=\"\",\"\",Runden!A20)","v":""},{"$f":"IF(A20=\"\",0,VLOOKUP(A20,Runden!$A$4:$U$53,IF($D$1=0,2,$D$1+1),FALSE))","v":0},{"$f":"IF(A20=\"\",0,VLOOKUP(A20,Rang!$A$4:$U$53,IF($D$1=0,2,$D$1+1),FALSE))","v":0},{"$f":"IF(A20=\"\",0,VLOOKUP(A20,Punkte!$A$4:$U$53,IF($D$1=0,2,$D$1+1),FALSE))","v":0},{"$f":"IF(C20=0,51,C20)+VLOOKUP(A20,Punkte!$A$4:$AC$53,27,FALSE)*0.001","v":51},{"$f":"IF(Runden!A20=\"\",\"\",Runden!A20)","v":""},{"$f":"IF(F20=\"\",0,VLOOKUP(F20,Punkte!$A$4:$AC$53,25,FALSE))","v":0},{"$f":"IF(F20=\"\",0,VLOOKUP(F20,Punkte!$A$4:$AC$53,22,FALSE))","v":0},{"$f":"IF(F20=\"\",0,VLOOKUP(F20,Punkte!$A$4:$AC$53,23,FALSE))","v":0},{"$f":"IF(F20=\"\",0,VLOOKUP(F20,Punkte!$A$4:$AC$53,24,FALSE))","v":0},101]
[{"$f":"IF(Runden!A21=\"\",\"\",Runden!A21)","v":""},{"$f":"IF(A21=\"\",0,VLOOKUP(A21,Runden!$A$4:$U$53,IF($D$1=0,2,$D$1+1),FALSE))","v":0},{"$f":"IF(A21=\"\",0,VLOOKUP(A21,Rang!$A$4:$U$53,IF($D$1=0,2,$D$1+1),FALSE))","v":0},{"$f":"IF(A21=\"\",0,VLOOKUP(A21,Punkte!$A$4:$U$53,IF($D$1=0,2,$D$1+1),FALSE))","v":0},{"$f":"IF(C21=0,51,C21)+VLOOKUP(A21,Punkte!$A$4:$AC$53,27,FALSE)*0.001","v":51},{"$f":"IF(Runden!A21=\"\",\"\",Runden!A21)","v":""},{"$f":"IF(F21=\"\",0,VLOOKUP(F21,Punkte!$A$4:$AC$53,25,FALSE))","v":0},{"$f":"IF(F21=\"\",0,VLOOKUP(F21,Punkte!$A$4:$AC$53,22,FALSE))","v":0},{"$f":"IF(F21=\"\",0,VLOOKUP(F21,Punkte!$A$4:$AC$53,23,FALSE))","v":0},{"$f":"IF(F21=\"\",0,VLOOKUP(F21,Punkte!$A$4:$AC$53,24,FALSE))","v":0},101]
[{"$f":"IF(Runden!A22=\"\",\"\",Runden!A22)","v":""},{"$f":"IF(A22=\"\",0,VLOOKUP(A22,Runden!$A$4:$U$53,IF($D$1=0,2,$D$1+1),FALSE))","v":0},{"$f":"IF(A22=\"\",0,VLOOKUP(A22,Rang!$A$4:$U$53,IF($D$1=0,2,$D$1+1),FALSE))","v":0},{"$f":"IF(A22=\"\",0,VLOOKUP(A22,Punkte!$A$4:$U$53,IF($D$1=0,2,$D$1+1),FALSE))","v":0},{"$f":"IF(C22=0,51,C22)+VLOOKUP(A22,Punkte!$A$4:$AC$53,27,FALSE)*0.001","v":51},{"$f":"IF(Runden!A22=\"\",\"\",Runden!A22)","v":""},{"$f":"IF(F22=\"\",0,VLOOKUP(F22,Punkte!$A$4:$AC$53,25,FALSE))","v":0},{"$f":"IF(F22=\"\",0,VLOOKUP(F22,Punkte!$A$4:$AC$53,22,FALSE))","v":0},{"$f":"IF(F22=\"\",0,VLOOKUP(F22,Punkte!$A$4:$AC$53,23,FALSE))","v":0},{"$f":"IF(F22=\"\",0,VLOOKUP(F22,Punkte!$A$4:$AC$53,24,FALSE))","v":0},{"$f":"IF(I22=0,51,I22)+IF(F22=\"\",50,0)","v":101}]
[{"$f":"IF(Runden!A23=\"\",\"\",Runden!A23)","v":""},{"$f":"IF(A23=\"\",0,VLOOKUP(A23,Runden!$A$4:$U$53,IF($D$1=0,2,$D$1+1),FALSE))","v":0},{"$f":"IF(A23=\"\",0,VLOOKUP(A23,Rang!$A$4:$U$53,IF($D$1=0,2,$D$1+1),FALSE))","v":0},{"$f":"IF(A23=\"\",0,VLOOKUP(A23,Punkte!$A$4:$U$53,IF($D$1=0,2,$D$1+1),FALSE))","v":0},{"$f":"IF(C23=0,51,C23)+VLOOKUP(A23,Punkte!$A$4:$AC$53,27,FALSE)*0.001","v":51},{"$f":"IF(Runden!A23=\"\",\"\",Runden!A23)","v":""},{"$f":"IF(F23=\"\",0,VLOOKUP(F23,Punkte!$A$4:$AC$53,25,FALSE))","v":0},{"$f":"IF(F23=\"\",0,VLOOKUP(F23,Punkte!$A$4:$AC$53,22,FALSE))","v":0},{"$f":"IF(F23=\"\",0,VLOOKUP(F23,Punkte!$A$4:$AC$53,23,FALSE))","v":0},{"$f":"IF(F23=\"\",0,VLOOKUP(F23,Punkte!$A$4:$AC$53,24,FALSE))","v":0},101]
[{"$f":"IF(Runden!A24=\"\",\"\",Runden!A24)","v":""},{"$f":"IF(A24=\"\",0,VLOOKUP(A24,Runden!$A$4:$U$53,IF($D$1=0,2,$D$1+1),FALSE))","v":0},{"$f":"IF(A24=\"\",0,VLOOKUP(A24,Rang!$A$4:$U$53,IF($D$1=0,2,$D$1+1),FALSE))","v":0},{"$f":"IF(A24=\"\",0,VLOOKUP(A24,Punkte!$A$4:$U$53,IF($D$1=0,2,$D$1+1),FALSE))","v":0},{"$f":"IF(C24=0,51,C24)+VLOOKUP(A24,Punkte!$A$4:$AC$53,27,FALSE)*0.001","v":51},{"$f":"IF(Runden!A24=\"\",\"\",Runden!A24)","v":""},{"$f":"IF(F24=\"\",0,VLOOKUP(F24,Punkte!$A$4:$AC$53,25,FALSE))","v":0},{"$f":"IF(F24=\"\",0,VLOOKUP(F24,Punkte!$A$4:$AC$53,22,FALSE))","v":0},{"$f":"IF(F24=\"\",0,VLOOKUP(F24,Punkte!$A$4:$AC$53,23,FALSE))","v":0},{"$f":"IF(F24=\"\",0,VLOOKUP(F24,Punkte!$A$4:$AC$53,24,FALSE))","v":0},101]
[{"$f":"IF(Runden!A25=\"\",\"\",Runden!A25)","v":""},{"$f":"IF(A25=\"\",0,VLOOKUP(A25,Runden!$A$4:$U$53,IF($D$1=0,2,$D$1+1),FALSE))","v":0},{"$f":"IF(A25=\"\",0,VLOOKUP(A25,Rang!$A$4:$U$53,IF($D$1=0,2,$D$1+1),FALSE))","v":0},{"$f":"IF(A25=\"\",0,VLOOKUP(A25,Punkte!$A$4:$U$53,IF($D$1=0,2,$D$1+1),FALSE))","v":0},{"$f":"IF(C25=0,51,C25)+VLOOKUP(A25,Punkte!$A$4:$AC$53,27,FALSE)*0.001","v":51},{"$f":"IF(Runden!A25=\"\",\"\",Runden!A25)","v":""},{"$f":"IF(F25=\"\",0,VLOOKUP(F25,Punkte!$A$4:$AC$53,25,FALSE))","v":0},{"$f":"IF(F25=\"\",0,VLOOKUP(F25,Punkte!$A$4:$AC$53,22,FALSE))","v":0},{"$f":"IF(F25=\"\",0,VLOOKUP(F25,Punkte!$A$4:$AC$53,23,FALSE))","v":0},{"$f":"IF(F25=\"\",0,VLOOKUP(F25,Punkte!$A$4:$AC$53,24,FALSE))","v":0},101]
[{"$f":"IF(Runden!A26=\"\",\"\",Runden!A26)","v":""},{"$f":"IF(A26=\"\",0,VLOOKUP(A26,Runden!$A$4:$U$53,IF($D$1=0,2,$D$1+1),FALSE))","v":0},{"$f":"IF(A26=\"\",0,VLOOKUP(A26,Rang!$A$4:$U$53,IF($D$1=0,2,$D$1+1),FALSE))","v":0},{"$f":"IF(A26=\"\",0,VLOOKUP(A26,Punkte!$A$4:$U$53,IF($D$1=0,2,$D$1+1),FALSE))","v":0},{"$f":"IF(C26=0,51,C26)+VLOOKUP(A26,Punkte!$A$4:$AC$53,27,FALSE)*0.001","v":51},{"$f":"IF(Runden!A26=\"\",\"\",Runden!A26)","v":""},{"$f":"IF(F26=\"\",0,VLOOKUP(F26,Punkte!$A$4:$AC$53,25,FALSE))","v":0},{"$f":"IF(F26=\"\",0,VLOOKUP(F26,Punkte!$A$4:$AC$53,22,FALSE))","v":0},{"$f":"IF(F26=\"\",0,VLOOKUP(F26,Punkte!$A$4:$AC$53,23,FALSE))","v":0},{"$f":"IF(F26=\"\",0,VLOOKUP(F26,Punkte!$A$4:$AC$53,24,FALSE))","v":0},101]
[{"$f":"IF(Runden!A27=\"\",\"\",Runden!A27)","v":""},{"$f":"IF(A27=\"\",0,VLOOKUP(A27,Runden!$A$4:$U$53,IF($D$1=0,2,$D$1+1),FALSE))","v":0},{"$f":"IF(A27=\"\",0,VLOOKUP(A27,Rang!$A$4:$U$53,IF($D$1=0,2,$D$1+1),FALSE))","v":0},{"$f":"IF(A27=\"\",0,VLOOKUP(A27,Punkte!$A$4:$U$53,IF($D$1=0,2,$D$1+1),FALSE))","v":0},{"$f":"IF(C27=0,51,C27)+VLOOKUP(A27,Punkte!$A$4:$AC$53,27,FALSE)*0.001","v":51},{"$f":"IF(Runden!A27=\"\",\"\",Runden!A27)","v":""},{"$f":"IF(F27=\"\",0,VLOOKUP(F27,Punkte!$A$4:$AC$53,25,FALSE))","v":0},{"$f":"IF(F27=\"\",0,VLOOKUP(F27,Punkte!$A$4:$AC$53,22,FALSE))","v":0},{"$f":"IF(F27=\"\",0,VLOOKUP(F27,Punkte!$A$4:$AC$53,23,FALSE))","v":0},{"$f":"IF(F27=\"\",0,VLOOKUP(F27,Punkte!$A$4:$AC$53,24,FALSE))","v":0},101]
[{"$f":"IF(Runden!A28=\"\",\"\",Runden!A28)","v":""},{"$f":"IF(A28=\"\",0,VLOOKUP(A28,Runden!$A$4:$U$53,IF($D$1=0,2,$D$1+1),FALSE))","v":0},{"$f":"IF(A28=\"\",0,VLOOKUP(A28,Rang!$A$4:$U$53,IF($D$1=0,2,$D$1+1),FALSE))","v":0},{"$f":"IF(A28=\"\",0,VLOOKUP(A28,Punkte!$A$4:$U$53,IF($D$1=0,2,$D$1+1),FALSE))","v":0},{"$f":"IF(C28=0,51,C28)+VLOOKUP(A28,Punkte!$A$4:$AC$53,27,FALSE)*0.001","v":51},{"$f":"IF(Runden!A28=\"\",\"\",Runden!A28)","v":""},{"$f":"IF(F28=\"\",0,VLOOKUP(F28,Punkte!$A$4:$AC$53,25,FALSE))","v":0},{"$f":"IF(F28=\"\",0,VLOOKUP(F28,Punkte!$A$4:$AC$53,22,FALSE))","v":0},{"$f":"IF(F28=\"\",0,VLOOKUP(F28,Punkte!$A$4:$AC$53,23,FALSE))","v":0},{"$f":"IF(F28=\"\",0,VLOOKUP(F28,Punkte!$A$4:$AC$53,24,FALSE))","v":0},101]
[{"$f":"IF(Runden!A29=\"\",\"\",Runden!A29)","v":""},{"$f":"IF(A29=\"\",0,VLOOKUP(A29,Runden!$A$4:$U$53,IF($D$1=0,2,$D$1+1),FALSE))","v":0},{"$f":"IF(A29=\"\",0,VLOOKUP(A29,Rang!$A$4:$U$53,IF($D$1=0,2,$D$1+1),FALSE))","v":0},{"$f":"IF(A29=\"\",0,VLOOKUP(A29,Punkte!$A$4:$U$53,IF($D$1=0,2,$D$1+1),FALSE))","v":0},{"$f":"IF(C29=0,51,C29)+VLOOKUP(A29,Punkte!$A$4:$AC$53,27,FALSE)*0.001","v":51},{"$f":"IF(Runden!A29=\"\",\"\",Runden!A29)","v":""},{"$f":"IF(F29=\"\",0,VLOOKUP(F29,Punkte!$A$4:$AC$53,25,FALSE))","v":0},{"$f":"IF(F29=\"\",0,VLOOKUP(F29,Punkte!$A$4:$AC$53,22,FALSE))","v":0},{"$f":"IF(F29=\"\",0,VLOOKUP(F29,Punkte!$A$4:$AC$53,23,FALSE))","v":0},{"$f":"IF(F29=\"\",0,VLOOKUP(F29,Punkte!$A$4:$AC$53,24,FALSE))","v":0},101]
[{"$f":"IF(Runden!A30=\"\",\"\",Runden!A30)","v":""},{"$f":"IF(A30=\"\",0,VLOOKUP(A30,Runden!$A$4:$U$53,IF($D$1=0,2,$D$1+1),FALSE))","v":0},{"$f":"IF(A30=\"\",0,VLOOKUP(A30,Rang!$A$4:$U$53,IF($D$1=0,2,$D$1+1),FALSE))","v":0},{"$f":"IF(A30=\"\",0,VLOOKUP(A30,Punkte!$A$4:$U$53,IF($D$1=0,2,$D$1+1),FALSE))","v":0},{"$f":"IF(C30=0,51,C30)+VLOOKUP(A30,Punkte!$A$4:$AC$53,27,FALSE)*0.001","v":51},{"$f":"IF(Runden!A30=\"\",\"\",Runden!A30)","v":""},{"$f":"IF(F30=\"\",0,VLOOKUP(F30,Punkte!$A$4:$AC$53,25,FALSE))","v":0},{"$f":"IF(F30=\"\",0,VLOOKUP(F30,Punkte!$A$4:$AC$53,22,FALSE))","v":0},{"$f":"IF(F30=\"\",0,VLOOKUP(F30,Punkte!$A$4:$AC$53,23,FALSE))","v":0},{"$f":"IF(F30=\"\",0,VLOOKUP(F30,Punkte!$A$4:$AC$53,24,FALSE))","v":0},101]
[{"$f":"IF(Runden!A31=\"\",\"\",Runden!A31)","v":""},{"$f":"IF(A31=\"\",0,VLOOKUP(A31,Runden!$A$4:$U$53,IF($D$1=0,2,$D$1+1),FALSE))","v":0},{"$f":"IF(A31=\"\",0,VLOOKUP(A31,Rang!$A$4:$U$53,IF($D$1=0,2,$D$1+1),FALSE))","v":0},{"$f":"IF(A31=\"\",0,VLOOKUP(A31,Punkte!$A$4:$U$53,IF($D$1=0,2,$D$1+1),FALSE))","v":0},{"$f":"IF(C31=0,51,C31)+VLOOKUP(A31,Punkte!$A$4:$AC$53,27,FALSE)*0.001","v":51},{"$f":"IF(Runden!A31=\"\",\"\",Runden!A31)","v":""},{"$f":"IF(F31=\"\",0,VLOOKUP(F31,Punkte!$A$4:$AC$53,25,FALSE))","v":0},{"$f":"IF(F31=\"\",0,VLOOKUP(F31,Punkte!$A$4:$AC$53,22,FALSE))","v":0},{"$f":"IF(F31=\"\",0,VLOOKUP(F31,Punkte!$A$4:$AC$53,23,FALSE))","v":0},{"$f":"IF(F31=\"\",0,VLOOKUP(F31,Punkte!$A$4:$AC$53,24,FALSE))","v":0},101]
[{"$f":"IF(Runden!A32=\"\",\"\",Runden!A32)","v":""},{"$f":"IF(A32=\"\",0,VLOOKUP(A32,Runden!$A$4:$U$53,IF($D$1=0,2,$D$1+1),FALSE))","v":0},{"$f":"IF(A32=\"\",0,VLOOKUP(A32,Rang!$A$4:$U$53,IF($D$1=0,2,$D$1+1),FALSE))","v":0},{"$f":"IF(A32=\"\",0,VLOOKUP(A32,Punkte!$A$4:$U$53,IF($D$1=0,2,$D$1+1),FALSE))","v":0},{"$f":"IF(C32=0,51,C32)+VLOOKUP(A32,Punkte!$A$4:$AC$53,27,FALSE)*0.001","v":51},{"$f":"IF(Runden!A32=\"\",\"\",Runden!A32)","v":""},{"$f":"IF(F32=\"\",0,VLOOKUP(F32,Punkte!$A$4:$AC$53,25,FALSE))","v":0},{"$f":"IF(F32=\"\",0,VLOOKUP(F32,Punkte!$A$4:$AC$53,22,FALSE))","v":0},{"$f":"IF(F32=\"\",0,VLOOKUP(F32,Punkte!$A$4:$AC$53,23,FALSE))","v":0},{"$f":"IF(F32=\"\",0,VLOOKUP(F32,Punkte!$A$4:$AC$53,24,FALSE))","v":0},101]
[{"$f":"IF(Runden!A33=\"\",\"\",Runden!A33)","v":""},{"$f":"IF(A33=\"\",0,VLOOKUP(A33,Runden!$A$4:$U$53,IF($D$1=0,2,$D$1+1),FALSE))","v":0},{"$f":"IF(A33=\"\",0,VLOOKUP(A33,Rang!$A$4:$U$53,IF($D$1=0,2,$D$1+1),FALSE))","v":0},{"$f":"IF(A33=\"\",0,VLOOKUP(A33,Punkte!$A$4:$U$53,IF($D$1=0,2,$D$1+1),FALSE))","v":0},{"$f":"IF(C33=0,51,C33)+VLOOKUP(A33,Punkte!$A$4:$AC$53,27,FALSE)*0.001","v":51},{"$f":"IF(Runden!A33=\"\",\"\",Runden!A33)","v":""},{"$f":"IF(F33=\"\",0,VLOOKUP(F33,Punkte!$A$4:$AC$53,25,FALSE))","v":0},{"$f":"IF(F33=\"\",0,VLOOKUP(F33,Punkte!$A$4:$AC$53,22,FALSE))","v":0},{"$f":"IF(F33=\"\",0,VLOOKUP(F33,Punkte!$A$4:$AC$53,23,FALSE))","v":0},{"$f":"IF(F33=\"\",0,VLOOKUP(F33,Punkte!$A$4:$AC$53,24,FALSE))","v":0},101]
[{"$f":"IF(Runden!A34=\"\",\"\",Runden!A34)","v":""},{"$f":"IF(A34=\"\",0,VLOOKUP(A34,Runden!$A$4:$U$53,IF($D$1=0,2,$D$1+1),FALSE))","v":0},{"$f":"IF(A34=\"\",0,VLOOKUP(A34,Rang!$A$4:$U$53,IF($D$1=0,2,$D$1+1),FALSE))","v":0},{"$f":"IF(A34=\"\",0,VLOOKUP(A34,Punkte!$A$4:$U$53,IF($D$1=0,2,$D$1+1),FALSE))","v":0},{"$f":"IF(C34=0,51,C34)+VLOOKUP(A34,Punkte!$A$4:$AC$53,27,FALSE)*0.001","v":51},{"$f":"IF(Runden!A34=\"\",\"\",Runden!A34)","v":""},{"$f":"IF(F34=\"\",0,VLOOKUP(F34,Punkte!$A$4:$AC$53,25,FALSE))","v":0},{"$f":"IF(F34=\"\",0,VLOOKUP(F34,Punkte!$A$4:$AC$53,22,FALSE))","v":0},{"$f":"IF(F34=\"\",0,VLOOKUP(F34,Punkte!$A$4:$AC$53,23,FALSE))","v":0},{"$f":"IF(F34=\"\",0,VLOOKUP(F34,Punkte!$A$4:$AC$53,24,FALSE))","v":0},101]
[{"$f":"IF(Runden!A35=\"\",\"\",Runden!A35)","v":""},{"$f":"IF(A35=\"\",0,VLOOKUP(A35,Runden!$A$4:$U$53,IF($D$1=0,2,$D$1+1),FALSE))","v":0},{"$f":"IF(A35=\"\",0,VLOOKUP(A35,Rang!$A$4:$U$53,IF($D$1=0,2,$D$1+1),FALSE))","v":0},{"$f":"IF(A35=\"\",0,VLOOKUP(A35,Punkte!$A$4:$U$53,IF($D$1=0,2,$D$1+1),FALSE))","v":0},{"$f":"IF(C35=0,51,C35)+VLOOKUP(A35,Punkte!$A$4:$AC$53,27,FALSE)*0.001","v":51},{"$f":"IF(Runden!A35=\"\",\"\",Runden!A35)","v":""},{"$f":"IF(F35=\"\",0,VLOOKUP(F35,Punkte!$A$4:$AC$53,25,FALSE))","v":0},{"$f":"IF(F35=\"\",0,VLOOKUP(F35,Punkte!$A$4:$AC$53,22,FALSE))","v":0},{"$f":"IF(F35=\"\",0,VLOOKUP(F35,Punkte!$A$4:$AC$53,23,FALSE))","v":0},{"$f":"IF(F35=\"\",0,VLOOKUP(F35,Punkte!$A$4:$AC$53,24,FALSE))","v":0},101]
[{"$f":"IF(Runden!A36=\"\",\"\",Runden!A36)","v":""},{"$f":"IF(A36=\"\",0,VLOOKUP(A36,Runden!$A$4:$U$53,IF($D$1=0,2,$D$1+1),FALSE))","v":0},{"$f":"IF(A36=\"\",0,VLOOKUP(A36,Rang!$A$4:$U$53,IF($D$1=0,2,$D$1+1),FALSE))","v":0},{"$f":"IF(A36=\"\",0,VLOOKUP(A36,Punkte!$A$4:$U$53,IF($D$1=0,2,$D$1+1),FALSE))","v":0},{"$f":"IF(C36=0,51,C36)+VLOOKUP(A36,Punkte!$A$4:$AC$53,27,FALSE)*0.001","v":51},{"$f":"IF(Runden!A36=\"\",\"\",Runden!A36)","v":""},{"$f":"IF(F36=\"\",0,VLOOKUP(F36,Punkte!$A$4:$AC$53,25,FALSE))","v":0},{"$f":"IF(F36=\"\",0,VLOOKUP(F36,Punkte!$A$4:$AC$53,22,FALSE))","v":0},{"$f":"IF(F36=\"\",0,VLOOKUP(F36,Punkte!$A$4:$AC$53,23,FALSE))","v":0},{"$f":"IF(F36=\"\",0,VLOOKUP(F36,Punkte!$A$4:$AC$53,24,FALSE))","v":0},101]
[{"$f":"IF(Runden!A37=\"\",\"\",Runden!A37)","v":""},{"$f":"IF(A37=\"\",0,VLOOKUP(A37,Runden!$A$4:$U$53,IF($D$1=0,2,$D$1+1),FALSE))","v":0},{"$f":"IF(A37=\"\",0,VLOOKUP(A37,Rang!$A$4:$U$53,IF($D$1=0,2,$D$1+1),FALSE))","v":0},{"$f":"IF(A37=\"\",0,VLOOKUP(A37,Punkte!$A$4:$U$53,IF($D$1=0,2,$D$1+1),FALSE))","v":0},{"$f":"IF(C37=0,51,C37)+VLOOKUP(A37,Punkte!$A$4:$AC$53,27,FALSE)*0.001","v":51},{"$f":"IF(Runden!A37=\"\",\"\",Runden!A37)","v":""},{"$f":"IF(F37=\"\",0,VLOOKUP(F37,Punkte!$A$4:$AC$53,25,FALSE))","v":0},{"$f":"IF(F37=\"\",0,VLOOKUP(F37,Punkte!$A$4:$AC$53,22,FALSE))","v":0},{"$f":"IF(F37=\"\",0,VLOOKUP(F37,Punkte!$A$4:$AC$53,23,FALSE))","v":0},{"$f":"IF(F37=\"\",0,VLOOKUP(F37,Punkte!$A$4:$AC$53,24,FALSE))","v":0},101]
[{"$f":"IF(Runden!A38=\"\",\"\",Runden!A38)","v":""},{"$f":"IF(A38=\"\",0,VLOOKUP(A38,Runden!$A$4:$U$53,IF($D$1=0,2,$D$1+1),FALSE))","v":0},{"$f":"IF(A38=\"\",0,VLOOKUP(A38,Rang!$A$4:$U$53,IF($D$1=0,2,$D$1+1),FALSE))","v":0},{"$f":"IF(A38=\"\",0,VLOOKUP(A38,Punkte!$A$4:$U$53,IF($D$1=0,2,$D$1+1),FALSE))","v":0},{"$f":"IF(C38=0,51,C38)+VLOOKUP(A38,Punkte!$A$4:$AC$53,27,FALSE)*0.001","v":51},{"$f":"IF(Runden!A38=\"\",\"\",Runden!A38)","v":""},{"$f":"IF(F38=\"\",0,VLOOKUP(F38,Punkte!$A$4:$AC$53,25,FALSE))","v":0},{"$f":"IF(F38=\"\",0,VLOOKUP(F38,Punkte!$A$4:$AC$53,22,FALSE))","v":0},{"$f":"IF(F38=\"\",0,VLOOKUP(F38,Punkte!$A$4:$AC$53,23,FALSE))","v":0},{"$f":"IF(F38=\"\",0,VLOOKUP(F38,Punkte!$A$4:$AC$53,24,FALSE))","v":0},101]
[{"$f":"IF(Runden!A39=\"\",\"\",Runden!A39)","v":""},{"$f":"IF(A39=\"\",0,VLOOKUP(A39,Runden!$A$4:$U$53,IF($D$1=0,2,$D$1+1),FALSE))","v":0},{"$f":"IF(A39=\"\",0,VLOOKUP(A39,Rang!$A$4:$U$53,IF($D$1=0,2,$D$1+1),FALSE))","v":0},{"$f":"IF(A39=\"\",0,VLOOKUP(A39,Punkte!$A$4:$U$53,IF($D$1=0,2,$D$1+1),FALSE))","v":0},{"$f":"IF(C39=0,51,C39)+VLOOKUP(A39,Punkte!$A$4:$AC$53,27,FALSE)*0.001","v":51},{"$f":"IF(Runden!A39=\"\",\"\",Runden!A39)","v":""},{"$f":"IF(F39=\"\",0,VLOOKUP(F39,Punkte!$A$4:$AC$53,25,FALSE))","v":0},{"$f":"IF(F39=\"\",0,VLOOKUP(F39,Punkte!$A$4:$AC$53,22,FALSE))","v":0},{"$f":"IF(F39=\"\",0,VLOOKUP(F39,Punkte!$A$4:$AC$53,23,FALSE))","v":0},{"$f":"IF(F39=\"\",0,VLOOKUP(F39,Punkte!$A$4:$AC$53,24,FALSE))","v":0},101]
[{"$f":"IF(Runden!A40=\"\",\"\",Runden!A40)","v":""},{"$f":"IF(A40=\"\",0,VLOOKUP(A40,Runden!$A$4:$U$53,IF($D$1=0,2,$D$1+1),FALSE))","v":0},{"$f":"IF(A40=\"\",0,VLOOKUP(A40,Rang!$A$4:$U$53,IF($D$1=0,2,$D$1+1),FALSE))","v":0},{"$f":"IF(A40=\"\",0,VLOOKUP(A40,Punkte!$A$4:$U$53,IF($D$1=0,2,$D$1+1),FALSE))","v":0},{"$f":"IF(C40=0,51,C40)+VLOOKUP(A40,Punkte!$A$4:$AC$53,27,FALSE)*0.001","v":51},{"$f":"IF(Runden!A40=\"\",\"\",Runden!A40)","v":""},{"$f":"IF(F40=\"\",0,VLOOKUP(F40,Punkte!$A$4:$AC$53,25,FALSE))","v":0},{"$f":"IF(F40=\"\",0,VLOOKUP(F40,Punkte!$A$4:$AC$53,22,FALSE))","v":0},{"$f":"IF(F40=\"\",0,VLOOKUP(F40,Punkte!$A$4:$AC$53,23,FALSE))","v":0},{"$f":"IF(F40=\"\",0,VLOOKUP(F40,Punkte!$A$4:$AC$53,24,FALSE))","v":0},101]
[{"$f":"IF(Runden!A41=\"\",\"\",Runden!A41)","v":""},{"$f":"IF(A41=\"\",0,VLOOKUP(A41,Runden!$A$4:$U$53,IF($D$1=0,2,$D$1+1),FALSE))","v":0},{"$f":"IF(A41=\"\",0,VLOOKUP(A41,Rang!$A$4:$U$53,IF($D$1=0,2,$D$1+1),FALSE))","v":0},{"$f":"IF(A41=\"\",0,VLOOKUP(A41,Punkte!$A$4:$U$53,IF($D$1=0,2,$D$1+1),FALSE))","v":0},{"$f":"IF(C41=0,51,C41)+VLOOKUP(A41,Punkte!$A$4:$AC$53,27,FALSE)*0.001","v":51},{"$f":"IF(Runden!A41=\"\",\"\",Runden!A41)","v":""},{"$f":"IF(F41=\"\",0,VLOOKUP(F41,Punkte!$A$4:$AC$53,25,FALSE))","v":0},{"$f":"IF(F41=\"\",0,VLOOKUP(F41,Punkte!$A$4:$AC$53,22,FALSE))","v":0},{"$f":"IF(F41=\"\",0,VLOOKUP(F41,Punkte!$A$4:$AC$53,23,FALSE))","v":0},{"$f":"IF(F41=\"\",0,VLOOKUP(F41,Punkte!$A$4:$AC$53,24,FALSE))","v":0},101]
[{"$f":"IF(Runden!A42=\"\",\"\",Runden!A42)","v":""},{"$f":"IF(A42=\"\",0,VLOOKUP(A42,Runden!$A$4:$U$53,IF($D$1=0,2,$D$1+1),FALSE))","v":0},{"$f":"IF(A42=\"\",0,VLOOKUP(A42,Rang!$A$4:$U$53,IF($D$1=0,2,$D$1+1),FALSE))","v":0},{"$f":"IF(A42=\"\",0,VLOOKUP(A42,Punkte!$A$4:$U$53,IF($D$1=0,2,$D$1+1),FALSE))","v":0},{"$f":"IF(C42=0,51,C42)+VLOOKUP(A42,Punkte!$A$4:$AC$53,27,FALSE)*0.001","v":51},{"$f":"IF(Runden!A42=\"\",\"\",Runden!A42)","v":""},{"$f":"IF(F42=\"\",0,VLOOKUP(F42,Punkte!$A$4:$AC$53,25,FALSE))","v":0},{"$f":"IF(F42=\"\",0,VLOOKUP(F42,Punkte!$A$4:$AC$53,22,FALSE))","v":0},{"$f":"IF(F42=\"\",0,VLOOKUP(F42,Punkte!$A$4:$AC$53,23,FALSE))","v":0},{"$f":"IF(F42=\"\",0,VLOOKUP(F42,Punkte!$A$4:$AC$53,24,FALSE))","v":0},101]
[{"$f":"IF(Runden!A43=\"\",\"\",Runden!A43)","v":""},{"$f":"IF(A43=\"\",0,VLOOKUP(A43,Runden!$A$4:$U$53,IF($D$1=0,2,$D$1+1),FALSE))","v":0},{"$f":"IF(A43=\"\",0,VLOOKUP(A43,Rang!$A$4:$U$53,IF($D$1=0,2,$D$1+1),FALSE))","v":0},{"$f":"IF(A43=\"\",0,VLOOKUP(A43,Punkte!$A$4:$U$53,IF($D$1=0,2,$D$1+1),FALSE))","v":0},{"$f":"IF(C43=0,51,C43)+VLOOKUP(A43,Punkte!$A$4:$AC$53,27,FALSE)*0.001","v":51},{"$f":"IF(Runden!A43=\"\",\"\",Runden!A43)","v":""},{"$f":"IF(F43=\"\",0,VLOOKUP(F43,Punkte!$A$4:$AC$53,25,FALSE))","v":0},{"$f":"IF(F43=\"\",0,VLOOKUP(F43,Punkte!$A$4:$AC$53,22,FALSE))","v":0},{"$f":"IF(F43=\"\",0,VLOOKUP(F43,Punkte!$A$4:$AC$53,23,FALSE))","v":0},{"$f":"IF(F43=\"\",0,VLOOKUP(F43,Punkte!$A$4:$AC$53,24,FALSE))","v":0},101]
[{"$f":"IF(Runden!A44=\"\",\"\",Runden!A44)","v":""},{"$f":"IF(A44=\"\",0,VLOOKUP(A44,Runden!$A$4:$U$53,IF($D$1=0,2,$D$1+1),FALSE))","v":0},{"$f":"IF(A44=\"\",0,VLOOKUP(A44,Rang!$A$4:$U$53,IF($D$1=0,2,$D$1+1),FALSE))","v":0},{"$f":"IF(A44=\"\",0,VLOOKUP(A44,Punkte!$A$4:$U$53,IF($D$1=0,2,$D$1+1),FALSE))","v":0},{"$f":"IF(C44=0,51,C44)+VLOOKUP(A44,Punkte!$A$4:$AC$53,27,FALSE)*0.001","v":51},{"$f":"IF(Runden!A44=\"\",\"\",Runden!A44)","v":""},{"$f":"IF(F44=\"\",0,VLOOKUP(F44,Punkte!$A$4:$AC$53,25,FALSE))","v":0},{"$f":"IF(F44=\"\",0,VLOOKUP(F44,Punkte!$A$4:$AC$53,22,FALSE))","v":0},{"$f":"IF(F44=\"\",0,VLOOKUP(F44,Punkte!$A$4:$AC$53,23,FALSE))","v":0},{"$f":"IF(F44=\"\",0,VLOOKUP(F44,Punkte!$A$4:$AC$53,24,FALSE))","v":0},101]
[{"$f":"IF(Runden!A45=\"\",\"\",Runden!A45)","v":""},{"$f":"IF(A45=\"\",0,VLOOKUP(A45,Runden!$A$4:$U$53,IF($D$1=0,2,$D$1+1),FALSE))","v":0},{"$f":"IF(A45=\"\",0,VLOOKUP(A45,Rang!$A$4:$U$53,IF($D$1=0,2,$D$1+1),FALSE))","v":0},{"$f":"IF(A45=\"\",0,VLOOKUP(A45,Punkte!$A$4:$U$53,IF($D$1=0,2,$D$1+1),FALSE))","v":0},{"$f":"IF(C45=0,51,C45)+VLOOKUP(A45,Punkte!$A$4:$AC$53,27,FALSE)*0.001","v":51},{"$f":"IF(Runden!A45=\"\",\"\",Runden!A45)","v":""},{"$f":"IF(F45=\"\",0,VLOOKUP(F45,Punkte!$A$4:$AC$53,25,FALSE))","v":0},{"$f":"IF(F45=\"\",0,VLOOKUP(F45,Punkte!$A$4:$AC$53,22,FALSE))","v":0},{"$f":"IF(F45=\"\",0,VLOOKUP(F45,Punkte!$A$4:$AC$53,23,FALSE))","v":0},{"$f":"IF(F45=\"\",0,VLOOKUP(F45,Punkte!$A$4:$AC$53,24,FALSE))","v":0},101]
[{"$f":"IF(Runden!A46=\"\",\"\",Runden!A46)","v":""},{"$f":"IF(A46=\"\",0,VLOOKUP(A46,Runden!$A$4:$U$53,IF($D$1=0,2,$D$1+1),FALSE))","v":0},{"$f":"IF(A46=\"\",0,VLOOKUP(A46,Rang!$A$4:$U$53,IF($D$1=0,2,$D$1+1),FALSE))","v":0},{"$f":"IF(A46=\"\",0,VLOOKUP(A46,Punkte!$A$4:$U$53,IF($D$1=0,2,$D$1+1),FALSE))","v":0},{"$f":"IF(C46=0,51,C46)+VLOOKUP(A46,Punkte!$A$4:$AC$53,27,FALSE)*0.001","v":51},{"$f":"IF(Runden!A46=\"\",\"\",Runden!A46)","v":""},{"$f":"IF(F46=\"\",0,VLOOKUP(F46,Punkte!$A$4:$AC$53,25,FALSE))","v":0},{"$f":"IF(F46=\"\",0,VLOOKUP(F46,Punkte!$A$4:$AC$53,22,FALSE))","v":0},{"$f":"IF(F46=\"\",0,VLOOKUP(F46,Punkte!$A$4:$AC$53,23,FALSE))","v":0},{"$f":"IF(F46=\"\",0,VLOOKUP(F46,Punkte!$A$4:$AC$53,24,FALSE))","v":0},101]
[{"$f":"IF(Runden!A47=\"\",\"\",Runden!A47)","v":""},{"$f":"IF(A47=\"\",0,VLOOKUP(A47,Runden!$A$4:$U$53,IF($D$1=0,2,$D$1+1),FALSE))","v":0},{"$f":"IF(A47=\"\",0,VLOOKUP(A47,Rang!$A$4:$U$53,IF($D$1=0,2,$D$1+1),FALSE))","v":0},{"$f":"IF(A47=\"\",0,VLOOKUP(A47,Punkte!$A$4:$U$53,IF($D$1=0,2,$D$1+1),FALSE))","v":0},{"$f":"IF(C47=0,51,C47)+VLOOKUP(A47,Punkte!$A$4:$AC$53,27,FALSE)*0.001","v":51},{"$f":"IF(Runden!A47=\"\",\"\",Runden!A47)","v":""},{"$f":"IF(F47=\"\",0,VLOOKUP(F47,Punkte!$A$4:$AC$53,25,FALSE))","v":0},{"$f":"IF(F47=\"\",0,VLOOKUP(F47,Punkte!$A$4:$AC$53,22,FALSE))","v":0},{"$f":"IF(F47=\"\",0,VLOOKUP(F47,Punkte!$A$4:$AC$53,23,FALSE))","v":0},{"$f":"IF(F47=\"\",0,VLOOKUP(F47,Punkte!$A$4:$AC$53,24,FALSE))","v":0},101]
[{"$f":"IF(Runden!A48=\"\",\"\",Runden!A48)","v":""},{"$f":"IF(A48=\"\",0,VLOOKUP(A48,Runden!$A$4:$U$53,IF($D$1=0,2,$D$1+1),FALSE))","v":0},{"$f":"IF(A48=\"\",0,VLOOKUP(A48,Rang!$A$4:$U$53,IF($D$1=0,2,$D$1+1),FALSE))","v":0},{"$f":"IF(A48=\"\",0,VLOOKUP(A48,Punkte!$A$4:$U$53,IF($D$1=0,2,$D$1+1),FALSE))","v":0},{"$f":"IF(C48=0,51,C48)+VLOOKUP(A48,Punkte!$A$4:$AC$53,27,FALSE)*0.001","v":51},{"$f":"IF(Runden!A48=\"\",\"\",Runden!A48)","v":""},{"$f":"IF(F48=\"\",0,VLOOKUP(F48,Punkte!$A$4:$AC$53,25,FALSE))","v":0},{"$f":"IF(F48=\"\",0,VLOOKUP(F48,Punkte!$A$4:$AC$53,22,FALSE))","v":0},{"$f":"IF(F48=\"\",0,VLOOKUP(F48,Punkte!$A$4:$AC$53,23,FALSE))","v":0},{"$f":"IF(F48=\"\",0,VLOOKUP(F48,Punkte!$A$4:$AC$53,24,FALSE))","v":0},101]
[{"$f":"IF(Runden!A49=\"\",\"\",Runden!A49)","v":""},{"$f":"IF(A49=\"\",0,VLOOKUP(A49,Runden!$A$4:$U$53,IF($D$1=0,2,$D$1+1),FALSE))","v":0},{"$f":"IF(A49=\"\",0,VLOOKUP(A49,Rang!$A$4:$U$53,IF($D$1=0,2,$D$1+1),FALSE))","v":0},{"$f":"IF(A49=\"\",0,VLOOKUP(A49,Punkte!$A$4:$U$53,IF($D$1=0,2,$D$1+1),FALSE))","v":0},{"$f":"IF(C49=0,51,C49)+VLOOKUP(A49,Punkte!$A$4:$AC$53,27,FALSE)*0.001","v":51},{"$f":"IF(Runden!A49=\"\",\"\",Runden!A49)","v":""},{"$f":"IF(F49=\"\",0,VLOOKUP(F49,Punkte!$A$4:$AC$53,25,FALSE))","v":0},{"$f":"IF(F49=\"\",0,VLOOKUP(F49,Punkte!$A$4:$AC$53,22,FALSE))","v":0},{"$f":"IF(F49=\"\",0,VLOOKUP(F49,Punkte!$A$4:$AC$53,23,FALSE))","v":0},{"$f":"IF(F49=\"\",0,VLOOKUP(F49,Punkte!$A$4:$AC$53,24,FALSE))","v":0},101]
[{"$f":"IF(Runden!A50=\"\",\"\",Runden!A50)","v":""},{"$f":"IF(A50=\"\",0,VLOOKUP(A50,Runden!$A$4:$U$53,IF($D$1=0,2,$D$1+1),FALSE))","v":0},{"$f":"IF(A50=\"\",0,VLOOKUP(A50,Rang!$A$4:$U$53,IF($D$1=0,2,$D$1+1),FALSE))","v":0},{"$f":"IF(A50=\"\",0,VLOOKUP(A50,Punkte!$A$4:$U$53,IF($D$1=0,2,$D$1+1),FALSE))","v":0},{"$f":"IF(C50=0,51,C50)+VLOOKUP(A50,Punkte!$A$4:$AC$53,27,FALSE)*0.001","v":51},{"$f":"IF(Runden!A50=\"\",\"\",Runden!A50)","v":""},{"$f":"IF(F50=\"\",0,VLOOKUP(F50,Punkte!$A$4:$AC$53,25,FALSE))","v":0},{"$f":"IF(F50=\"\",0,VLOOKUP(F50,Punkte!$A$4:$AC$53,22,FALSE))","v":0},{"$f":"IF(F50=\"\",0,VLOOKUP(F50,Punkte!$A$4:$AC$53,23,FALSE))","v":0},{"$f":"IF(F50=\"\",0,VLOOKUP(F50,Punkte!$A$4:$AC$53,24,FALSE))","v":0},101]
[{"$f":"IF(Runden!A51=\"\",\"\",Runden!A51)","v":""},{"$f":"IF(A51=\"\",0,VLOOKUP(A51,Runden!$A$4:$U$53,IF($D$1=0,2,$D$1+1),FALSE))","v":0},{"$f":"IF(A51=\"\",0,VLOOKUP(A51,Rang!$A$4:$U$53,IF($D$1=0,2,$D$1+1),FALSE))","v":0},{"$f":"IF(A51=\"\",0,VLOOKUP(A51,Punkte!$A$4:$U$53,IF($D$1=0,2,$D$1+1),FALSE))","v":0},{"$f":"IF(C51=0,51,C51)+VLOOKUP(A51,Punkte!$A$4:$AC$53,27,FALSE)*0.001","v":51},{"$f":"IF(Runden!A51=\"\",\"\",Runden!A51)","v":""},{"$f":"IF(F51=\"\",0,VLOOKUP(F51,Punkte!$A$4:$AC$53,25,FALSE))","v":0},{"$f":"IF(F51=\"\",0,VLOOKUP(F51,Punkte!$A$4:$AC$53,22,FALSE))","v":0},{"$f":"IF(F51=\"\",0,VLOOKUP(F51,Punkte!$A$4:$AC$53,23,FALSE))","v":0},{"$f":"IF(F51=\"\",0,VLOOKUP(F51,Punkte!$A$4:$AC$53,24,FALSE))","v":0},101]
[{"$f":"IF(Runden!A52=\"\",\"\",Runden!A52)","v":""},{"$f":"IF(A52=\"\",0,VLOOKUP(A52,Runden!$A$4:$U$53,IF($D$1=0,2,$D$1+1),FALSE))","v":0},{"$f":"IF(A52=\"\",0,VLOOKUP(A52,Rang!$A$4:$U$53,IF($D$1=0,2,$D$1+1),FALSE))","v":0},{"$f":"IF(A52=\"\",0,VLOOKUP(A52,Punkte!$A$4:$U$53,IF($D$1=0,2,$D$1+1),FALSE))","v":0},{"$f":"IF(C52=0,51,C52)+VLOOKUP(A52,Punkte!$A$4:$AC$53,27,FALSE)*0.001","v":51},{"$f":"IF(Runden!A52=\"\",\"\",Runden!A52)","v":""},{"$f":"IF(F52=\"\",0,VLOOKUP(F52,Punkte!$A$4:$AC$53,25,FALSE))","v":0},{"$f":"IF(F52=\"\",0,VLOOKUP(F52,Punkte!$A$4:$AC$53,22,FALSE))","v":0},{"$f":"IF(F52=\"\",0,VLOOKUP(F52,Punkte!$A$4:$AC$53,23,FALSE))","v":0},{"$f":"IF(F52=\"\",0,VLOOKUP(F52,Punkte!$A$4:$AC$53,24,FALSE))","v":0},101]
[{"$f":"IF(Runden!A53=\"\",\"\",Runden!A53)","v":""},{"$f":"IF(A53=\"\",0,VLOOKUP(A53,Runden!$A$4:$U$53,IF($D$1=0,2,$D$1+1),FALSE))","v":0},{"$f":"IF(A53=\"\",0,VLOOKUP(A53,Rang!$A$4:$U$53,IF($D$1=0,2,$D$1+1),FALSE))","v":0},{"$f":"IF(A53=\"\",0,VLOOKUP(A53,Punkte!$A$4:$U$53,IF($D$1=0,2,$D$1+1),FALSE))","v":0},{"$f":"IF(C53=0,51,C53)+VLOOKUP(A53,Punkte!$A$4:$AC$53,27,FALSE)*0.001","v":51},{"$f":"IF(Runden!A53=\"\",\"\",Runden!A53)","v":""},{"$f":"IF(F53=\"\",0,VLOOKUP(F53,Punkte!$A$4:$AC$53,25,FALSE))","v":0},{"$f":"IF(F53=\"\",0,VLOOKUP(F53,Punkte!$A$4:$AC$53,22,FALSE))","v":0},{"$f":"IF(F53=\"\",0,VLOOKUP(F53,Punkte!$A$4:$AC$53,23,FALSE))","v":0},{"$f":"IF(F53=\"\",0,VLOOKUP(F53,Punkte!$A$4:$AC$53,24,FALSE))","v":0},101]
[{"$f":"\"Teilnehmer \"&D1&\". Lauf:\"","v":"Teilnehmer 1. Lauf:"},{"$f":"COUNTIF(B3:B53,\">0\")","v":10},null,null,null,"Teilnehmer insgesamt:",null,{"$f":"COUNTIF(J4:J53,\">0\")","v":10}]